{"text_format":"1","workbook":"xlsx","n_sheets":5,"sheets":["各団体(個人）申込書記入例(必読)","男子ﾃﾞｰﾀ貼付ｼｰﾄ","【様式1-1】男子団体（個人）申込書","女子ﾃﾞｰﾀ貼付ｼｰﾄ","【様式1-2】女子団体（個人）申込書"],"not_rendered":{"charts":0,"images":3,"macros":1,"external_links":2,"defined_names":30,"comments":5,"pivot_tables":0},"unopened":[],"bounds":{"document_bytes":16777216,"sheet_cells":100000,"rows_first":2000,"rows_last":500,"rows_between":2000,"halvings":0,"cell_chars":16384,"cell_head_chars":4096},"cells_cut":0,"cells_raw":0,"read":"whole","date_system":"1900"}

{"sheet":"各団体(個人）申込書記入例(必読)","index":0,"n_rows":79,"n_cols":20,"rows_kept":79,"cut":false,"hidden":false,"merged":[[50,17,50,18],[51,5,51,12],[51,15,51,17],[53,5,53,12],[55,5,56,5],[55,13,55,17],[55,18,56,18],[55,12,56,12],[76,14,76,15],[68,14,68,15],[70,14,70,15],[72,14,72,15],[74,14,74,15],[55,0,56,0],[55,3,56,3],[55,1,55,2],[55,6,56,6],[55,11,56,11],[55,7,56,7],[55,9,56,9]]}
["競技会参加申込の入力方法"]
[]
[null,"０．","この申込ファイルはマクロを含んでいます。以下の警告が出た場合は、「コンテンツの有効化」をクリックしてください。"]
[]
[]
[]
[]
[]
[]
[]
[null,"１．","「JAAF START」 のページから、登録情報のCSVファイルを作成する。"]
[null,null,"作成したCSVデータを貼り付ける。その際、男子のデータは 「男子ﾃﾞｰﾀ貼付ｼｰﾄ」 に、女子のデータは 「女子ﾃﾞｰﾀ貼付ｼｰﾄ」 に貼り付ける。"]
[null,null,"「登録番号」 (もしくはＡ列) が昇順になるように並べ替える。 ( 「登録番号順に並び替え」 ボタンで並び替えてください。)"]
[]
[null,null,"※今年度は新潟県登録番号をまだ割り振られていない会員が多い為、登録番号が空欄のままだと先へ進めませんので、1から連番を入力してください。"]
[]
[]
[]
[]
[]
{"$rows_left_out":60}
{"sheet":"男子ﾃﾞｰﾀ貼付ｼｰﾄ","index":1,"n_rows":202,"n_cols":27,"rows_kept":202,"cut":false,"hidden":false,"merged":[[1,0,1,3]]}
[null,null,null,null,"貼り付けはＥ列から→"]
["↓    この列には貼り付けないで！    ↓",null,null,null,"年度","JAAF ID","氏名\n（姓）","氏名\n（名）","登録\n番号","フリガナ\n（姓）","フリガナ\n（名）","英字\n（姓）","英字\n（名）","国籍","性別","登録都道\n府県番号","登録都道\n府県名","団体UID","団体ID","団体名","団体名\n略称1","団体名\n略称2","生年月日","旧団体\nコード","備\n考","学\n年","団体\n区分"]
[{"$f":"IF(I3=\"\",\"\",I3)","v":""},{"$f":"IF(A3=\"\",\"\",G3&\" \"&H3)","v":""},{"$f":"IF(A3=\"\",\"\",ASC(J3&\" \"&K3))","v":""},{"$f":"IF(A3=\"\",\"\",L3&\" \"&M3)","v":""}]
["","","",""]
["","","",""]
["","","",""]
["","","",""]
["","","",""]
["","","",""]
["","","",""]
["","","",""]
["","","",""]
["","","",""]
["","","",""]
["","","",""]
["","","",""]
["","","",""]
["","","",""]
["","","",""]
["","","",""]
{"$rows_left_out":183}
{"sheet":"【様式1-1】男子団体（個人）申込書","index":2,"n_rows":88,"n_cols":21,"rows_kept":88,"cut":false,"hidden":false,"merged":[[5,0,6,0],[5,1,5,2],[5,3,6,3],[5,5,6,5],[5,6,6,6],[0,17,0,18],[86,3,86,8],[87,3,87,8],[5,12,6,12],[84,3,84,5],[85,3,85,8],[5,18,6,18],[1,15,1,17],[5,13,5,17],[81,13,81,16],[82,13,82,16],[1,5,1,12],[3,5,3,12],[5,7,6,7],[5,9,6,9],[5,11,6,11]]}
[null,null,null,null,null,null,null,null,null,null,null,null,null,null,null,null,null,"【様式1-1】"]
[null,null,null,"大会名",null,"第６７回北陸地域陸上競技選手権大会",null,null,null,null,null,null,null,null,null,"参加申込一覧表（　男子　）"]
[]
[null,null,null,"所属学校・団体名 ",null,{"$f":"IF(男子ﾃﾞｰﾀ貼付ｼｰﾄ!$U$3=\"\",\"\",男子ﾃﾞｰﾀ貼付ｼｰﾄ!$U$3)","v":""},null,null,null,null,null,null,null,{"$f":"IF(F4=\"\",\"\",男子ﾃﾞｰﾀ貼付ｼｰﾄ!X3)","v":""}]
[]
[null,"ﾅﾝﾊﾞｰ",null,"氏　名","ﾌﾘｶﾞﾅ","ｱﾙﾌｧﾍﾞｯﾄ表記","性別","学年","生年","所属","登録","国籍","種目","参加標準記録",null,null,null,null,"備考"]
[null,"北","県",null,"(半角ｶﾀｶﾅ)",null,null,null,"西暦4桁",null,"都道府県",null,null,"記録","順位","年月(4桁)","大会名","場所"]
[1,null,null,{"$f":"IF($C8=\"\",\"\",VLOOKUP($C8,男子ﾃﾞｰﾀ貼付ｼｰﾄ!$A$3:$AA$201,2))","v":""},{"$f":"IF($C8=\"\",\"\",VLOOKUP($C8,男子ﾃﾞｰﾀ貼付ｼｰﾄ!$A$3:$AA$201,3))","v":""},{"$f":"IF($C8=\"\",\"\",VLOOKUP($C8,男子ﾃﾞｰﾀ貼付ｼｰﾄ!$A$3:$AA$201,4))","v":""},"男",{"$f":"IF($C8=\"\",\"\",RIGHT(VLOOKUP($C8,男子ﾃﾞｰﾀ貼付ｼｰﾄ!$A$3:$AA$201,26),1))","v":""},{"$f":"IF($C8=\"\",\"\",TEXT(VLOOKUP($C8,男子ﾃﾞｰﾀ貼付ｼｰﾄ!$A$3:$AA$201,23),\"yyyy\"))","v":""},{"$f":"IF($C8=\"\",\"\",VLOOKUP($C8,男子ﾃﾞｰﾀ貼付ｼｰﾄ!$A$3:$AA$201,21))","v":""},{"$f":"IF($C8=\"\",\"\",VLOOKUP($C8,男子ﾃﾞｰﾀ貼付ｼｰﾄ!$A$3:$AA$201,17))","v":""},{"$f":"IF($C8=\"\",\"\",VLOOKUP($C8,男子ﾃﾞｰﾀ貼付ｼｰﾄ!$A$3:$AA$201,14))","v":""},null,null,null,null,null,null,null,{"$f":"IF(U8=\"\",\"\",TEXT(U8,\"yyyymmdd\"))","v":""},{"$f":"IF(D8=\"\",\"\",VLOOKUP(C8,男子ﾃﾞｰﾀ貼付ｼｰﾄ!$A$3:$AA$202,23))","v":""}]
[2,null,null,{"$f":"IF($C9=\"\",\"\",VLOOKUP($C9,男子ﾃﾞｰﾀ貼付ｼｰﾄ!$A$3:$AA$201,2))","v":""},{"$f":"IF($C9=\"\",\"\",VLOOKUP($C9,男子ﾃﾞｰﾀ貼付ｼｰﾄ!$A$3:$AA$201,3))","v":""},{"$f":"IF($C9=\"\",\"\",VLOOKUP($C9,男子ﾃﾞｰﾀ貼付ｼｰﾄ!$A$3:$AA$201,4))","v":""},"男",{"$f":"IF($C9=\"\",\"\",RIGHT(VLOOKUP($C9,男子ﾃﾞｰﾀ貼付ｼｰﾄ!$A$3:$AA$201,26),1))","v":""},{"$f":"IF($C9=\"\",\"\",TEXT(VLOOKUP($C9,男子ﾃﾞｰﾀ貼付ｼｰﾄ!$A$3:$AA$201,23),\"yyyy\"))","v":""},{"$f":"IF($C9=\"\",\"\",VLOOKUP($C9,男子ﾃﾞｰﾀ貼付ｼｰﾄ!$A$3:$AA$201,21))","v":""},{"$f":"IF($C9=\"\",\"\",VLOOKUP($C9,男子ﾃﾞｰﾀ貼付ｼｰﾄ!$A$3:$AA$201,17))","v":""},{"$f":"IF($C9=\"\",\"\",VLOOKUP($C9,男子ﾃﾞｰﾀ貼付ｼｰﾄ!$A$3:$AA$201,14))","v":""},null,null,null,null,null,null,null,{"$f":"IF(U9=\"\",\"\",TEXT(U9,\"yyyymmdd\"))","v":""},{"$f":"IF(D9=\"\",\"\",VLOOKUP(C9,男子ﾃﾞｰﾀ貼付ｼｰﾄ!$A$3:$AA$202,23))","v":""}]
[3,null,null,{"$f":"IF($C10=\"\",\"\",VLOOKUP($C10,男子ﾃﾞｰﾀ貼付ｼｰﾄ!$A$3:$AA$201,2))","v":""},{"$f":"IF($C10=\"\",\"\",VLOOKUP($C10,男子ﾃﾞｰﾀ貼付ｼｰﾄ!$A$3:$AA$201,3))","v":""},{"$f":"IF($C10=\"\",\"\",VLOOKUP($C10,男子ﾃﾞｰﾀ貼付ｼｰﾄ!$A$3:$AA$201,4))","v":""},"男",{"$f":"IF($C10=\"\",\"\",RIGHT(VLOOKUP($C10,男子ﾃﾞｰﾀ貼付ｼｰﾄ!$A$3:$AA$201,26),1))","v":""},{"$f":"IF($C10=\"\",\"\",TEXT(VLOOKUP($C10,男子ﾃﾞｰﾀ貼付ｼｰﾄ!$A$3:$AA$201,23),\"yyyy\"))","v":""},{"$f":"IF($C10=\"\",\"\",VLOOKUP($C10,男子ﾃﾞｰﾀ貼付ｼｰﾄ!$A$3:$AA$201,21))","v":""},{"$f":"IF($C10=\"\",\"\",VLOOKUP($C10,男子ﾃﾞｰﾀ貼付ｼｰﾄ!$A$3:$AA$201,17))","v":""},{"$f":"IF($C10=\"\",\"\",VLOOKUP($C10,男子ﾃﾞｰﾀ貼付ｼｰﾄ!$A$3:$AA$201,14))","v":""},null,null,null,null,null,null,null,"",{"$f":"IF(D10=\"\",\"\",VLOOKUP(C10,男子ﾃﾞｰﾀ貼付ｼｰﾄ!$A$3:$AA$202,23))","v":""}]
[4,null,null,{"$f":"IF($C11=\"\",\"\",VLOOKUP($C11,男子ﾃﾞｰﾀ貼付ｼｰﾄ!$A$3:$AA$201,2))","v":""},{"$f":"IF($C11=\"\",\"\",VLOOKUP($C11,男子ﾃﾞｰﾀ貼付ｼｰﾄ!$A$3:$AA$201,3))","v":""},{"$f":"IF($C11=\"\",\"\",VLOOKUP($C11,男子ﾃﾞｰﾀ貼付ｼｰﾄ!$A$3:$AA$201,4))","v":""},"男",{"$f":"IF($C11=\"\",\"\",RIGHT(VLOOKUP($C11,男子ﾃﾞｰﾀ貼付ｼｰﾄ!$A$3:$AA$201,26),1))","v":""},{"$f":"IF($C11=\"\",\"\",TEXT(VLOOKUP($C11,男子ﾃﾞｰﾀ貼付ｼｰﾄ!$A$3:$AA$201,23),\"yyyy\"))","v":""},{"$f":"IF($C11=\"\",\"\",VLOOKUP($C11,男子ﾃﾞｰﾀ貼付ｼｰﾄ!$A$3:$AA$201,21))","v":""},{"$f":"IF($C11=\"\",\"\",VLOOKUP($C11,男子ﾃﾞｰﾀ貼付ｼｰﾄ!$A$3:$AA$201,17))","v":""},{"$f":"IF($C11=\"\",\"\",VLOOKUP($C11,男子ﾃﾞｰﾀ貼付ｼｰﾄ!$A$3:$AA$201,14))","v":""},null,null,null,null,null,null,null,"",{"$f":"IF(D11=\"\",\"\",VLOOKUP(C11,男子ﾃﾞｰﾀ貼付ｼｰﾄ!$A$3:$AA$202,23))","v":""}]
[5,null,null,{"$f":"IF($C12=\"\",\"\",VLOOKUP($C12,男子ﾃﾞｰﾀ貼付ｼｰﾄ!$A$3:$AA$201,2))","v":""},{"$f":"IF($C12=\"\",\"\",VLOOKUP($C12,男子ﾃﾞｰﾀ貼付ｼｰﾄ!$A$3:$AA$201,3))","v":""},{"$f":"IF($C12=\"\",\"\",VLOOKUP($C12,男子ﾃﾞｰﾀ貼付ｼｰﾄ!$A$3:$AA$201,4))","v":""},"男",{"$f":"IF($C12=\"\",\"\",RIGHT(VLOOKUP($C12,男子ﾃﾞｰﾀ貼付ｼｰﾄ!$A$3:$AA$201,26),1))","v":""},{"$f":"IF($C12=\"\",\"\",TEXT(VLOOKUP($C12,男子ﾃﾞｰﾀ貼付ｼｰﾄ!$A$3:$AA$201,23),\"yyyy\"))","v":""},{"$f":"IF($C12=\"\",\"\",VLOOKUP($C12,男子ﾃﾞｰﾀ貼付ｼｰﾄ!$A$3:$AA$201,21))","v":""},{"$f":"IF($C12=\"\",\"\",VLOOKUP($C12,男子ﾃﾞｰﾀ貼付ｼｰﾄ!$A$3:$AA$201,17))","v":""},{"$f":"IF($C12=\"\",\"\",VLOOKUP($C12,男子ﾃﾞｰﾀ貼付ｼｰﾄ!$A$3:$AA$201,14))","v":""},null,null,null,null,null,null,null,"",{"$f":"IF(D12=\"\",\"\",VLOOKUP(C12,男子ﾃﾞｰﾀ貼付ｼｰﾄ!$A$3:$AA$202,23))","v":""}]
[6,null,null,{"$f":"IF($C13=\"\",\"\",VLOOKUP($C13,男子ﾃﾞｰﾀ貼付ｼｰﾄ!$A$3:$AA$201,2))","v":""},{"$f":"IF($C13=\"\",\"\",VLOOKUP($C13,男子ﾃﾞｰﾀ貼付ｼｰﾄ!$A$3:$AA$201,3))","v":""},{"$f":"IF($C13=\"\",\"\",VLOOKUP($C13,男子ﾃﾞｰﾀ貼付ｼｰﾄ!$A$3:$AA$201,4))","v":""},"男",{"$f":"IF($C13=\"\",\"\",RIGHT(VLOOKUP($C13,男子ﾃﾞｰﾀ貼付ｼｰﾄ!$A$3:$AA$201,26),1))","v":""},{"$f":"IF($C13=\"\",\"\",TEXT(VLOOKUP($C13,男子ﾃﾞｰﾀ貼付ｼｰﾄ!$A$3:$AA$201,23),\"yyyy\"))","v":""},{"$f":"IF($C13=\"\",\"\",VLOOKUP($C13,男子ﾃﾞｰﾀ貼付ｼｰﾄ!$A$3:$AA$201,21))","v":""},{"$f":"IF($C13=\"\",\"\",VLOOKUP($C13,男子ﾃﾞｰﾀ貼付ｼｰﾄ!$A$3:$AA$201,17))","v":""},{"$f":"IF($C13=\"\",\"\",VLOOKUP($C13,男子ﾃﾞｰﾀ貼付ｼｰﾄ!$A$3:$AA$201,14))","v":""},null,null,null,null,null,null,null,"",{"$f":"IF(D13=\"\",\"\",VLOOKUP(C13,男子ﾃﾞｰﾀ貼付ｼｰﾄ!$A$3:$AA$202,23))","v":""}]
[7,null,null,{"$f":"IF($C14=\"\",\"\",VLOOKUP($C14,男子ﾃﾞｰﾀ貼付ｼｰﾄ!$A$3:$AA$201,2))","v":""},{"$f":"IF($C14=\"\",\"\",VLOOKUP($C14,男子ﾃﾞｰﾀ貼付ｼｰﾄ!$A$3:$AA$201,3))","v":""},{"$f":"IF($C14=\"\",\"\",VLOOKUP($C14,男子ﾃﾞｰﾀ貼付ｼｰﾄ!$A$3:$AA$201,4))","v":""},"男",{"$f":"IF($C14=\"\",\"\",RIGHT(VLOOKUP($C14,男子ﾃﾞｰﾀ貼付ｼｰﾄ!$A$3:$AA$201,26),1))","v":""},{"$f":"IF($C14=\"\",\"\",TEXT(VLOOKUP($C14,男子ﾃﾞｰﾀ貼付ｼｰﾄ!$A$3:$AA$201,23),\"yyyy\"))","v":""},{"$f":"IF($C14=\"\",\"\",VLOOKUP($C14,男子ﾃﾞｰﾀ貼付ｼｰﾄ!$A$3:$AA$201,21))","v":""},{"$f":"IF($C14=\"\",\"\",VLOOKUP($C14,男子ﾃﾞｰﾀ貼付ｼｰﾄ!$A$3:$AA$201,17))","v":""},{"$f":"IF($C14=\"\",\"\",VLOOKUP($C14,男子ﾃﾞｰﾀ貼付ｼｰﾄ!$A$3:$AA$201,14))","v":""},null,null,null,null,null,null,null,"",{"$f":"IF(D14=\"\",\"\",VLOOKUP(C14,男子ﾃﾞｰﾀ貼付ｼｰﾄ!$A$3:$AA$202,23))","v":""}]
[8,null,null,{"$f":"IF($C15=\"\",\"\",VLOOKUP($C15,男子ﾃﾞｰﾀ貼付ｼｰﾄ!$A$3:$AA$201,2))","v":""},{"$f":"IF($C15=\"\",\"\",VLOOKUP($C15,男子ﾃﾞｰﾀ貼付ｼｰﾄ!$A$3:$AA$201,3))","v":""},{"$f":"IF($C15=\"\",\"\",VLOOKUP($C15,男子ﾃﾞｰﾀ貼付ｼｰﾄ!$A$3:$AA$201,4))","v":""},"男",{"$f":"IF($C15=\"\",\"\",RIGHT(VLOOKUP($C15,男子ﾃﾞｰﾀ貼付ｼｰﾄ!$A$3:$AA$201,26),1))","v":""},{"$f":"IF($C15=\"\",\"\",TEXT(VLOOKUP($C15,男子ﾃﾞｰﾀ貼付ｼｰﾄ!$A$3:$AA$201,23),\"yyyy\"))","v":""},{"$f":"IF($C15=\"\",\"\",VLOOKUP($C15,男子ﾃﾞｰﾀ貼付ｼｰﾄ!$A$3:$AA$201,21))","v":""},{"$f":"IF($C15=\"\",\"\",VLOOKUP($C15,男子ﾃﾞｰﾀ貼付ｼｰﾄ!$A$3:$AA$201,17))","v":""},{"$f":"IF($C15=\"\",\"\",VLOOKUP($C15,男子ﾃﾞｰﾀ貼付ｼｰﾄ!$A$3:$AA$201,14))","v":""},null,null,null,null,null,null,null,"",{"$f":"IF(D15=\"\",\"\",VLOOKUP(C15,男子ﾃﾞｰﾀ貼付ｼｰﾄ!$A$3:$AA$202,23))","v":""}]
[9,null,null,{"$f":"IF($C16=\"\",\"\",VLOOKUP($C16,男子ﾃﾞｰﾀ貼付ｼｰﾄ!$A$3:$AA$201,2))","v":""},{"$f":"IF($C16=\"\",\"\",VLOOKUP($C16,男子ﾃﾞｰﾀ貼付ｼｰﾄ!$A$3:$AA$201,3))","v":""},{"$f":"IF($C16=\"\",\"\",VLOOKUP($C16,男子ﾃﾞｰﾀ貼付ｼｰﾄ!$A$3:$AA$201,4))","v":""},"男",{"$f":"IF($C16=\"\",\"\",RIGHT(VLOOKUP($C16,男子ﾃﾞｰﾀ貼付ｼｰﾄ!$A$3:$AA$201,26),1))","v":""},{"$f":"IF($C16=\"\",\"\",TEXT(VLOOKUP($C16,男子ﾃﾞｰﾀ貼付ｼｰﾄ!$A$3:$AA$201,23),\"yyyy\"))","v":""},{"$f":"IF($C16=\"\",\"\",VLOOKUP($C16,男子ﾃﾞｰﾀ貼付ｼｰﾄ!$A$3:$AA$201,21))","v":""},{"$f":"IF($C16=\"\",\"\",VLOOKUP($C16,男子ﾃﾞｰﾀ貼付ｼｰﾄ!$A$3:$AA$201,17))","v":""},{"$f":"IF($C16=\"\",\"\",VLOOKUP($C16,男子ﾃﾞｰﾀ貼付ｼｰﾄ!$A$3:$AA$201,14))","v":""},null,null,null,null,null,null,null,"",{"$f":"IF(D16=\"\",\"\",VLOOKUP(C16,男子ﾃﾞｰﾀ貼付ｼｰﾄ!$A$3:$AA$202,23))","v":""}]
[10,null,null,{"$f":"IF($C17=\"\",\"\",VLOOKUP($C17,男子ﾃﾞｰﾀ貼付ｼｰﾄ!$A$3:$AA$201,2))","v":""},{"$f":"IF($C17=\"\",\"\",VLOOKUP($C17,男子ﾃﾞｰﾀ貼付ｼｰﾄ!$A$3:$AA$201,3))","v":""},{"$f":"IF($C17=\"\",\"\",VLOOKUP($C17,男子ﾃﾞｰﾀ貼付ｼｰﾄ!$A$3:$AA$201,4))","v":""},"男",{"$f":"IF($C17=\"\",\"\",RIGHT(VLOOKUP($C17,男子ﾃﾞｰﾀ貼付ｼｰﾄ!$A$3:$AA$201,26),1))","v":""},{"$f":"IF($C17=\"\",\"\",TEXT(VLOOKUP($C17,男子ﾃﾞｰﾀ貼付ｼｰﾄ!$A$3:$AA$201,23),\"yyyy\"))","v":""},{"$f":"IF($C17=\"\",\"\",VLOOKUP($C17,男子ﾃﾞｰﾀ貼付ｼｰﾄ!$A$3:$AA$201,21))","v":""},{"$f":"IF($C17=\"\",\"\",VLOOKUP($C17,男子ﾃﾞｰﾀ貼付ｼｰﾄ!$A$3:$AA$201,17))","v":""},{"$f":"IF($C17=\"\",\"\",VLOOKUP($C17,男子ﾃﾞｰﾀ貼付ｼｰﾄ!$A$3:$AA$201,14))","v":""},null,null,null,null,null,null,null,"",{"$f":"IF(D17=\"\",\"\",VLOOKUP(C17,男子ﾃﾞｰﾀ貼付ｼｰﾄ!$A$3:$AA$202,23))","v":""}]
[11,null,null,{"$f":"IF($C18=\"\",\"\",VLOOKUP($C18,男子ﾃﾞｰﾀ貼付ｼｰﾄ!$A$3:$AA$201,2))","v":""},{"$f":"IF($C18=\"\",\"\",VLOOKUP($C18,男子ﾃﾞｰﾀ貼付ｼｰﾄ!$A$3:$AA$201,3))","v":""},{"$f":"IF($C18=\"\",\"\",VLOOKUP($C18,男子ﾃﾞｰﾀ貼付ｼｰﾄ!$A$3:$AA$201,4))","v":""},"男",{"$f":"IF($C18=\"\",\"\",RIGHT(VLOOKUP($C18,男子ﾃﾞｰﾀ貼付ｼｰﾄ!$A$3:$AA$201,26),1))","v":""},{"$f":"IF($C18=\"\",\"\",TEXT(VLOOKUP($C18,男子ﾃﾞｰﾀ貼付ｼｰﾄ!$A$3:$AA$201,23),\"yyyy\"))","v":""},{"$f":"IF($C18=\"\",\"\",VLOOKUP($C18,男子ﾃﾞｰﾀ貼付ｼｰﾄ!$A$3:$AA$201,21))","v":""},{"$f":"IF($C18=\"\",\"\",VLOOKUP($C18,男子ﾃﾞｰﾀ貼付ｼｰﾄ!$A$3:$AA$201,17))","v":""},{"$f":"IF($C18=\"\",\"\",VLOOKUP($C18,男子ﾃﾞｰﾀ貼付ｼｰﾄ!$A$3:$AA$201,14))","v":""},null,null,null,null,null,null,null,"",{"$f":"IF(D18=\"\",\"\",VLOOKUP(C18,男子ﾃﾞｰﾀ貼付ｼｰﾄ!$A$3:$AA$202,23))","v":""}]
[12,null,null,{"$f":"IF($C19=\"\",\"\",VLOOKUP($C19,男子ﾃﾞｰﾀ貼付ｼｰﾄ!$A$3:$AA$201,2))","v":""},{"$f":"IF($C19=\"\",\"\",VLOOKUP($C19,男子ﾃﾞｰﾀ貼付ｼｰﾄ!$A$3:$AA$201,3))","v":""},{"$f":"IF($C19=\"\",\"\",VLOOKUP($C19,男子ﾃﾞｰﾀ貼付ｼｰﾄ!$A$3:$AA$201,4))","v":""},"男",{"$f":"IF($C19=\"\",\"\",RIGHT(VLOOKUP($C19,男子ﾃﾞｰﾀ貼付ｼｰﾄ!$A$3:$AA$201,26),1))","v":""},{"$f":"IF($C19=\"\",\"\",TEXT(VLOOKUP($C19,男子ﾃﾞｰﾀ貼付ｼｰﾄ!$A$3:$AA$201,23),\"yyyy\"))","v":""},{"$f":"IF($C19=\"\",\"\",VLOOKUP($C19,男子ﾃﾞｰﾀ貼付ｼｰﾄ!$A$3:$AA$201,21))","v":""},{"$f":"IF($C19=\"\",\"\",VLOOKUP($C19,男子ﾃﾞｰﾀ貼付ｼｰﾄ!$A$3:$AA$201,17))","v":""},{"$f":"IF($C19=\"\",\"\",VLOOKUP($C19,男子ﾃﾞｰﾀ貼付ｼｰﾄ!$A$3:$AA$201,14))","v":""},null,null,null,null,null,null,null,"",{"$f":"IF(D19=\"\",\"\",VLOOKUP(C19,男子ﾃﾞｰﾀ貼付ｼｰﾄ!$A$3:$AA$202,23))","v":""}]
[13,null,null,{"$f":"IF($C20=\"\",\"\",VLOOKUP($C20,男子ﾃﾞｰﾀ貼付ｼｰﾄ!$A$3:$AA$201,2))","v":""},{"$f":"IF($C20=\"\",\"\",VLOOKUP($C20,男子ﾃﾞｰﾀ貼付ｼｰﾄ!$A$3:$AA$201,3))","v":""},{"$f":"IF($C20=\"\",\"\",VLOOKUP($C20,男子ﾃﾞｰﾀ貼付ｼｰﾄ!$A$3:$AA$201,4))","v":""},"男",{"$f":"IF($C20=\"\",\"\",RIGHT(VLOOKUP($C20,男子ﾃﾞｰﾀ貼付ｼｰﾄ!$A$3:$AA$201,26),1))","v":""},{"$f":"IF($C20=\"\",\"\",TEXT(VLOOKUP($C20,男子ﾃﾞｰﾀ貼付ｼｰﾄ!$A$3:$AA$201,23),\"yyyy\"))","v":""},{"$f":"IF($C20=\"\",\"\",VLOOKUP($C20,男子ﾃﾞｰﾀ貼付ｼｰﾄ!$A$3:$AA$201,21))","v":""},{"$f":"IF($C20=\"\",\"\",VLOOKUP($C20,男子ﾃﾞｰﾀ貼付ｼｰﾄ!$A$3:$AA$201,17))","v":""},{"$f":"IF($C20=\"\",\"\",VLOOKUP($C20,男子ﾃﾞｰﾀ貼付ｼｰﾄ!$A$3:$AA$201,14))","v":""},null,null,null,null,null,null,null,"",{"$f":"IF(D20=\"\",\"\",VLOOKUP(C20,男子ﾃﾞｰﾀ貼付ｼｰﾄ!$A$3:$AA$202,23))","v":""}]
{"$rows_left_out":69}
{"sheet":"女子ﾃﾞｰﾀ貼付ｼｰﾄ","index":3,"n_rows":202,"n_cols":27,"rows_kept":202,"cut":false,"hidden":false,"merged":[[1,0,1,3]]}
[null,null,null,null,"貼り付けはＥ列から→"]
["↓    この列には貼り付けないで！    ↓",null,null,null,"年度","JAAF ID","氏名\n（姓）","氏名\n（名）","登録\n番号","フリガナ\n（姓）","フリガナ\n（名）","英字\n（姓）","英字\n（名）","国籍","性別","登録都道\n府県番号","登録都道\n府県名","団体UID","団体ID","団体名","団体名\n略称1","団体名\n略称2","生年月日","旧団体\nコード","備\n考","学\n年","団体\n区分"]
[{"$f":"IF(I3=\"\",\"\",I3)","v":""},{"$f":"IF(A3=\"\",\"\",G3&\" \"&H3)","v":""},{"$f":"IF(A3=\"\",\"\",ASC(J3&\" \"&K3))","v":""},{"$f":"IF(A3=\"\",\"\",L3&\" \"&M3)","v":""}]
["","","",""]
["","","",""]
["","","",""]
["","","",""]
["","","",""]
["","","",""]
["","","",""]
["","","",""]
["","","",""]
["","","",""]
["","","",""]
["","","",""]
["","","",""]
["","","",""]
["","","",""]
["","","",""]
["","","",""]
{"$rows_left_out":183}
{"sheet":"【様式1-2】女子団体（個人）申込書","index":4,"n_rows":87,"n_cols":21,"rows_kept":87,"cut":false,"hidden":false,"merged":[[81,13,81,16],[82,13,82,16],[85,3,85,8],[1,5,1,12],[3,5,3,12],[86,3,86,8],[5,12,6,12],[83,3,83,4],[84,3,84,8],[5,5,6,5],[5,11,6,11],[5,7,6,7],[5,9,6,9],[0,17,0,18],[5,18,6,18],[5,0,6,0],[5,1,5,2],[5,3,6,3],[5,6,6,6],[1,15,1,17],[5,13,5,17]]}
[null,null,null,null,null,null,null,null,null,null,null,null,null,null,null,null,null,"【様式1-2】"]
[null,null,null,"大会名",null,"第６７回北陸地域陸上競技選手権大会",null,null,null,null,null,null,null,null,null,"参加申込一覧表（　女子　）"]
[]
[null,null,null,"所属学校・団体名 ",null,{"$f":"IF(女子ﾃﾞｰﾀ貼付ｼｰﾄ!U3=\"\",\"\",女子ﾃﾞｰﾀ貼付ｼｰﾄ!U3)","v":""},null,null,null,null,null,null,null,{"$f":"IF(F4=\"\",\"\",女子ﾃﾞｰﾀ貼付ｼｰﾄ!X3)","v":""}]
[]
[null,"ﾅﾝﾊﾞｰ",null,"氏　名","ﾌﾘｶﾞﾅ","ｱﾙﾌｧﾍﾞｯﾄ表記","性別","学年","生年","所属","登録","国籍","種目","参加標準記録",null,null,null,null,"備考"]
[null,"北","県",null,"(半角ｶﾀｶﾅ)",null,null,null,"西暦4桁",null,"都道府県",null,null,"記録","順位","年月(4桁)","大会名","場所"]
[1,null,null,{"$f":"IF($C8=\"\",\"\",VLOOKUP($C8,女子ﾃﾞｰﾀ貼付ｼｰﾄ!$A$3:$AA$34,2))","v":""},{"$f":"IF($C8=\"\",\"\",VLOOKUP($C8,女子ﾃﾞｰﾀ貼付ｼｰﾄ!$A$3:$AA$34,3))","v":""},{"$f":"IF($C8=\"\",\"\",VLOOKUP($C8,女子ﾃﾞｰﾀ貼付ｼｰﾄ!$A$3:$AA$34,4))","v":""},"女",{"$f":"IF($C8=\"\",\"\",RIGHT(VLOOKUP($C8,女子ﾃﾞｰﾀ貼付ｼｰﾄ!$A$3:$AA$34,26),1))","v":""},{"$f":"IF($C8=\"\",\"\",TEXT(VLOOKUP($C8,女子ﾃﾞｰﾀ貼付ｼｰﾄ!$A$3:$AA$34,23),\"yyyy\"))","v":""},{"$f":"IF($C8=\"\",\"\",VLOOKUP($C8,女子ﾃﾞｰﾀ貼付ｼｰﾄ!$A$3:$AA$34,21))","v":""},{"$f":"IF($C8=\"\",\"\",VLOOKUP($C8,女子ﾃﾞｰﾀ貼付ｼｰﾄ!$A$3:$AA$34,17))","v":""},{"$f":"IF($C8=\"\",\"\",VLOOKUP($C8,女子ﾃﾞｰﾀ貼付ｼｰﾄ!$A$3:$AA$34,14))","v":""},null,null,null,null,null,null,null,{"$f":"IF(U8=\"\",\"\",TEXT(U8,\"yyyymmdd\"))","v":""},{"$f":"IF(D8=\"\",\"\",VLOOKUP(C8,女子ﾃﾞｰﾀ貼付ｼｰﾄ!$A$3:$AA$202,23))","v":""}]
[2,null,null,{"$f":"IF($C9=\"\",\"\",VLOOKUP($C9,女子ﾃﾞｰﾀ貼付ｼｰﾄ!$A$3:$AA$34,2))","v":""},{"$f":"IF($C9=\"\",\"\",VLOOKUP($C9,女子ﾃﾞｰﾀ貼付ｼｰﾄ!$A$3:$AA$34,3))","v":""},{"$f":"IF($C9=\"\",\"\",VLOOKUP($C9,女子ﾃﾞｰﾀ貼付ｼｰﾄ!$A$3:$AA$34,4))","v":""},"女",{"$f":"IF($C9=\"\",\"\",RIGHT(VLOOKUP($C9,女子ﾃﾞｰﾀ貼付ｼｰﾄ!$A$3:$AA$34,26),1))","v":""},{"$f":"IF($C9=\"\",\"\",TEXT(VLOOKUP($C9,女子ﾃﾞｰﾀ貼付ｼｰﾄ!$A$3:$AA$34,23),\"yyyy\"))","v":""},{"$f":"IF($C9=\"\",\"\",VLOOKUP($C9,女子ﾃﾞｰﾀ貼付ｼｰﾄ!$A$3:$AA$34,21))","v":""},{"$f":"IF($C9=\"\",\"\",VLOOKUP($C9,女子ﾃﾞｰﾀ貼付ｼｰﾄ!$A$3:$AA$34,17))","v":""},{"$f":"IF($C9=\"\",\"\",VLOOKUP($C9,女子ﾃﾞｰﾀ貼付ｼｰﾄ!$A$3:$AA$34,14))","v":""},null,null,null,null,null,null,null,{"$f":"IF(U9=\"\",\"\",TEXT(U9,\"yyyymmdd\"))","v":""},{"$f":"IF(D9=\"\",\"\",VLOOKUP(C9,女子ﾃﾞｰﾀ貼付ｼｰﾄ!$A$3:$AA$202,23))","v":""}]
[3,null,null,{"$f":"IF($C10=\"\",\"\",VLOOKUP($C10,女子ﾃﾞｰﾀ貼付ｼｰﾄ!$A$3:$AA$34,2))","v":""},{"$f":"IF($C10=\"\",\"\",VLOOKUP($C10,女子ﾃﾞｰﾀ貼付ｼｰﾄ!$A$3:$AA$34,3))","v":""},{"$f":"IF($C10=\"\",\"\",VLOOKUP($C10,女子ﾃﾞｰﾀ貼付ｼｰﾄ!$A$3:$AA$34,4))","v":""},"女",{"$f":"IF($C10=\"\",\"\",RIGHT(VLOOKUP($C10,女子ﾃﾞｰﾀ貼付ｼｰﾄ!$A$3:$AA$34,26),1))","v":""},{"$f":"IF($C10=\"\",\"\",TEXT(VLOOKUP($C10,女子ﾃﾞｰﾀ貼付ｼｰﾄ!$A$3:$AA$34,23),\"yyyy\"))","v":""},{"$f":"IF($C10=\"\",\"\",VLOOKUP($C10,女子ﾃﾞｰﾀ貼付ｼｰﾄ!$A$3:$AA$34,21))","v":""},{"$f":"IF($C10=\"\",\"\",VLOOKUP($C10,女子ﾃﾞｰﾀ貼付ｼｰﾄ!$A$3:$AA$34,17))","v":""},{"$f":"IF($C10=\"\",\"\",VLOOKUP($C10,女子ﾃﾞｰﾀ貼付ｼｰﾄ!$A$3:$AA$34,14))","v":""},null,null,null,null,null,null,null,"",{"$f":"IF(D10=\"\",\"\",VLOOKUP(C10,女子ﾃﾞｰﾀ貼付ｼｰﾄ!$A$3:$AA$202,23))","v":""}]
[4,null,null,{"$f":"IF($C11=\"\",\"\",VLOOKUP($C11,女子ﾃﾞｰﾀ貼付ｼｰﾄ!$A$3:$AA$34,2))","v":""},{"$f":"IF($C11=\"\",\"\",VLOOKUP($C11,女子ﾃﾞｰﾀ貼付ｼｰﾄ!$A$3:$AA$34,3))","v":""},{"$f":"IF($C11=\"\",\"\",VLOOKUP($C11,女子ﾃﾞｰﾀ貼付ｼｰﾄ!$A$3:$AA$34,4))","v":""},"女",{"$f":"IF($C11=\"\",\"\",RIGHT(VLOOKUP($C11,女子ﾃﾞｰﾀ貼付ｼｰﾄ!$A$3:$AA$34,26),1))","v":""},{"$f":"IF($C11=\"\",\"\",TEXT(VLOOKUP($C11,女子ﾃﾞｰﾀ貼付ｼｰﾄ!$A$3:$AA$34,23),\"yyyy\"))","v":""},{"$f":"IF($C11=\"\",\"\",VLOOKUP($C11,女子ﾃﾞｰﾀ貼付ｼｰﾄ!$A$3:$AA$34,21))","v":""},{"$f":"IF($C11=\"\",\"\",VLOOKUP($C11,女子ﾃﾞｰﾀ貼付ｼｰﾄ!$A$3:$AA$34,17))","v":""},{"$f":"IF($C11=\"\",\"\",VLOOKUP($C11,女子ﾃﾞｰﾀ貼付ｼｰﾄ!$A$3:$AA$34,14))","v":""},null,null,null,null,null,null,null,"",{"$f":"IF(D11=\"\",\"\",VLOOKUP(C11,女子ﾃﾞｰﾀ貼付ｼｰﾄ!$A$3:$AA$202,23))","v":""}]
[5,null,null,{"$f":"IF($C12=\"\",\"\",VLOOKUP($C12,女子ﾃﾞｰﾀ貼付ｼｰﾄ!$A$3:$AA$34,2))","v":""},{"$f":"IF($C12=\"\",\"\",VLOOKUP($C12,女子ﾃﾞｰﾀ貼付ｼｰﾄ!$A$3:$AA$34,3))","v":""},{"$f":"IF($C12=\"\",\"\",VLOOKUP($C12,女子ﾃﾞｰﾀ貼付ｼｰﾄ!$A$3:$AA$34,4))","v":""},"女",{"$f":"IF($C12=\"\",\"\",RIGHT(VLOOKUP($C12,女子ﾃﾞｰﾀ貼付ｼｰﾄ!$A$3:$AA$34,26),1))","v":""},{"$f":"IF($C12=\"\",\"\",TEXT(VLOOKUP($C12,女子ﾃﾞｰﾀ貼付ｼｰﾄ!$A$3:$AA$34,23),\"yyyy\"))","v":""},{"$f":"IF($C12=\"\",\"\",VLOOKUP($C12,女子ﾃﾞｰﾀ貼付ｼｰﾄ!$A$3:$AA$34,21))","v":""},{"$f":"IF($C12=\"\",\"\",VLOOKUP($C12,女子ﾃﾞｰﾀ貼付ｼｰﾄ!$A$3:$AA$34,17))","v":""},{"$f":"IF($C12=\"\",\"\",VLOOKUP($C12,女子ﾃﾞｰﾀ貼付ｼｰﾄ!$A$3:$AA$34,14))","v":""},null,null,null,null,null,null,null,"",{"$f":"IF(D12=\"\",\"\",VLOOKUP(C12,女子ﾃﾞｰﾀ貼付ｼｰﾄ!$A$3:$AA$202,23))","v":""}]
[6,null,null,{"$f":"IF($C13=\"\",\"\",VLOOKUP($C13,女子ﾃﾞｰﾀ貼付ｼｰﾄ!$A$3:$AA$34,2))","v":""},{"$f":"IF($C13=\"\",\"\",VLOOKUP($C13,女子ﾃﾞｰﾀ貼付ｼｰﾄ!$A$3:$AA$34,3))","v":""},{"$f":"IF($C13=\"\",\"\",VLOOKUP($C13,女子ﾃﾞｰﾀ貼付ｼｰﾄ!$A$3:$AA$34,4))","v":""},"女",{"$f":"IF($C13=\"\",\"\",RIGHT(VLOOKUP($C13,女子ﾃﾞｰﾀ貼付ｼｰﾄ!$A$3:$AA$34,26),1))","v":""},{"$f":"IF($C13=\"\",\"\",TEXT(VLOOKUP($C13,女子ﾃﾞｰﾀ貼付ｼｰﾄ!$A$3:$AA$34,23),\"yyyy\"))","v":""},{"$f":"IF($C13=\"\",\"\",VLOOKUP($C13,女子ﾃﾞｰﾀ貼付ｼｰﾄ!$A$3:$AA$34,21))","v":""},{"$f":"IF($C13=\"\",\"\",VLOOKUP($C13,女子ﾃﾞｰﾀ貼付ｼｰﾄ!$A$3:$AA$34,17))","v":""},{"$f":"IF($C13=\"\",\"\",VLOOKUP($C13,女子ﾃﾞｰﾀ貼付ｼｰﾄ!$A$3:$AA$34,14))","v":""},null,null,null,null,null,null,null,"",{"$f":"IF(D13=\"\",\"\",VLOOKUP(C13,女子ﾃﾞｰﾀ貼付ｼｰﾄ!$A$3:$AA$202,23))","v":""}]
[7,null,null,{"$f":"IF($C14=\"\",\"\",VLOOKUP($C14,女子ﾃﾞｰﾀ貼付ｼｰﾄ!$A$3:$AA$34,2))","v":""},{"$f":"IF($C14=\"\",\"\",VLOOKUP($C14,女子ﾃﾞｰﾀ貼付ｼｰﾄ!$A$3:$AA$34,3))","v":""},{"$f":"IF($C14=\"\",\"\",VLOOKUP($C14,女子ﾃﾞｰﾀ貼付ｼｰﾄ!$A$3:$AA$34,4))","v":""},"女",{"$f":"IF($C14=\"\",\"\",RIGHT(VLOOKUP($C14,女子ﾃﾞｰﾀ貼付ｼｰﾄ!$A$3:$AA$34,26),1))","v":""},{"$f":"IF($C14=\"\",\"\",TEXT(VLOOKUP($C14,女子ﾃﾞｰﾀ貼付ｼｰﾄ!$A$3:$AA$34,23),\"yyyy\"))","v":""},{"$f":"IF($C14=\"\",\"\",VLOOKUP($C14,女子ﾃﾞｰﾀ貼付ｼｰﾄ!$A$3:$AA$34,21))","v":""},{"$f":"IF($C14=\"\",\"\",VLOOKUP($C14,女子ﾃﾞｰﾀ貼付ｼｰﾄ!$A$3:$AA$34,17))","v":""},{"$f":"IF($C14=\"\",\"\",VLOOKUP($C14,女子ﾃﾞｰﾀ貼付ｼｰﾄ!$A$3:$AA$34,14))","v":""},null,null,null,null,null,null,null,"",{"$f":"IF(D14=\"\",\"\",VLOOKUP(C14,女子ﾃﾞｰﾀ貼付ｼｰﾄ!$A$3:$AA$202,23))","v":""}]
[8,null,null,{"$f":"IF($C15=\"\",\"\",VLOOKUP($C15,女子ﾃﾞｰﾀ貼付ｼｰﾄ!$A$3:$AA$34,2))","v":""},{"$f":"IF($C15=\"\",\"\",VLOOKUP($C15,女子ﾃﾞｰﾀ貼付ｼｰﾄ!$A$3:$AA$34,3))","v":""},{"$f":"IF($C15=\"\",\"\",VLOOKUP($C15,女子ﾃﾞｰﾀ貼付ｼｰﾄ!$A$3:$AA$34,4))","v":""},"女",{"$f":"IF($C15=\"\",\"\",RIGHT(VLOOKUP($C15,女子ﾃﾞｰﾀ貼付ｼｰﾄ!$A$3:$AA$34,26),1))","v":""},{"$f":"IF($C15=\"\",\"\",TEXT(VLOOKUP($C15,女子ﾃﾞｰﾀ貼付ｼｰﾄ!$A$3:$AA$34,23),\"yyyy\"))","v":""},{"$f":"IF($C15=\"\",\"\",VLOOKUP($C15,女子ﾃﾞｰﾀ貼付ｼｰﾄ!$A$3:$AA$34,21))","v":""},{"$f":"IF($C15=\"\",\"\",VLOOKUP($C15,女子ﾃﾞｰﾀ貼付ｼｰﾄ!$A$3:$AA$34,17))","v":""},{"$f":"IF($C15=\"\",\"\",VLOOKUP($C15,女子ﾃﾞｰﾀ貼付ｼｰﾄ!$A$3:$AA$34,14))","v":""},null,null,null,null,null,null,null,"",{"$f":"IF(D15=\"\",\"\",VLOOKUP(C15,女子ﾃﾞｰﾀ貼付ｼｰﾄ!$A$3:$AA$202,23))","v":""}]
[9,null,null,{"$f":"IF($C16=\"\",\"\",VLOOKUP($C16,女子ﾃﾞｰﾀ貼付ｼｰﾄ!$A$3:$AA$34,2))","v":""},{"$f":"IF($C16=\"\",\"\",VLOOKUP($C16,女子ﾃﾞｰﾀ貼付ｼｰﾄ!$A$3:$AA$34,3))","v":""},{"$f":"IF($C16=\"\",\"\",VLOOKUP($C16,女子ﾃﾞｰﾀ貼付ｼｰﾄ!$A$3:$AA$34,4))","v":""},"女",{"$f":"IF($C16=\"\",\"\",RIGHT(VLOOKUP($C16,女子ﾃﾞｰﾀ貼付ｼｰﾄ!$A$3:$AA$34,26),1))","v":""},{"$f":"IF($C16=\"\",\"\",TEXT(VLOOKUP($C16,女子ﾃﾞｰﾀ貼付ｼｰﾄ!$A$3:$AA$34,23),\"yyyy\"))","v":""},{"$f":"IF($C16=\"\",\"\",VLOOKUP($C16,女子ﾃﾞｰﾀ貼付ｼｰﾄ!$A$3:$AA$34,21))","v":""},{"$f":"IF($C16=\"\",\"\",VLOOKUP($C16,女子ﾃﾞｰﾀ貼付ｼｰﾄ!$A$3:$AA$34,17))","v":""},{"$f":"IF($C16=\"\",\"\",VLOOKUP($C16,女子ﾃﾞｰﾀ貼付ｼｰﾄ!$A$3:$AA$34,14))","v":""},null,null,null,null,null,null,null,"",{"$f":"IF(D16=\"\",\"\",VLOOKUP(C16,女子ﾃﾞｰﾀ貼付ｼｰﾄ!$A$3:$AA$202,23))","v":""}]
[10,null,null,{"$f":"IF($C17=\"\",\"\",VLOOKUP($C17,女子ﾃﾞｰﾀ貼付ｼｰﾄ!$A$3:$AA$34,2))","v":""},{"$f":"IF($C17=\"\",\"\",VLOOKUP($C17,女子ﾃﾞｰﾀ貼付ｼｰﾄ!$A$3:$AA$34,3))","v":""},{"$f":"IF($C17=\"\",\"\",VLOOKUP($C17,女子ﾃﾞｰﾀ貼付ｼｰﾄ!$A$3:$AA$34,4))","v":""},"女",{"$f":"IF($C17=\"\",\"\",RIGHT(VLOOKUP($C17,女子ﾃﾞｰﾀ貼付ｼｰﾄ!$A$3:$AA$34,26),1))","v":""},{"$f":"IF($C17=\"\",\"\",TEXT(VLOOKUP($C17,女子ﾃﾞｰﾀ貼付ｼｰﾄ!$A$3:$AA$34,23),\"yyyy\"))","v":""},{"$f":"IF($C17=\"\",\"\",VLOOKUP($C17,女子ﾃﾞｰﾀ貼付ｼｰﾄ!$A$3:$AA$34,21))","v":""},{"$f":"IF($C17=\"\",\"\",VLOOKUP($C17,女子ﾃﾞｰﾀ貼付ｼｰﾄ!$A$3:$AA$34,17))","v":""},{"$f":"IF($C17=\"\",\"\",VLOOKUP($C17,女子ﾃﾞｰﾀ貼付ｼｰﾄ!$A$3:$AA$34,14))","v":""},null,null,null,null,null,null,null,"",{"$f":"IF(D17=\"\",\"\",VLOOKUP(C17,女子ﾃﾞｰﾀ貼付ｼｰﾄ!$A$3:$AA$202,23))","v":""}]
[11,null,null,{"$f":"IF($C18=\"\",\"\",VLOOKUP($C18,女子ﾃﾞｰﾀ貼付ｼｰﾄ!$A$3:$AA$34,2))","v":""},{"$f":"IF($C18=\"\",\"\",VLOOKUP($C18,女子ﾃﾞｰﾀ貼付ｼｰﾄ!$A$3:$AA$34,3))","v":""},{"$f":"IF($C18=\"\",\"\",VLOOKUP($C18,女子ﾃﾞｰﾀ貼付ｼｰﾄ!$A$3:$AA$34,4))","v":""},"女",{"$f":"IF($C18=\"\",\"\",RIGHT(VLOOKUP($C18,女子ﾃﾞｰﾀ貼付ｼｰﾄ!$A$3:$AA$34,26),1))","v":""},{"$f":"IF($C18=\"\",\"\",TEXT(VLOOKUP($C18,女子ﾃﾞｰﾀ貼付ｼｰﾄ!$A$3:$AA$34,23),\"yyyy\"))","v":""},{"$f":"IF($C18=\"\",\"\",VLOOKUP($C18,女子ﾃﾞｰﾀ貼付ｼｰﾄ!$A$3:$AA$34,21))","v":""},{"$f":"IF($C18=\"\",\"\",VLOOKUP($C18,女子ﾃﾞｰﾀ貼付ｼｰﾄ!$A$3:$AA$34,17))","v":""},{"$f":"IF($C18=\"\",\"\",VLOOKUP($C18,女子ﾃﾞｰﾀ貼付ｼｰﾄ!$A$3:$AA$34,14))","v":""},null,null,null,null,null,null,null,"",{"$f":"IF(D18=\"\",\"\",VLOOKUP(C18,女子ﾃﾞｰﾀ貼付ｼｰﾄ!$A$3:$AA$202,23))","v":""}]
[12,null,null,{"$f":"IF($C19=\"\",\"\",VLOOKUP($C19,女子ﾃﾞｰﾀ貼付ｼｰﾄ!$A$3:$AA$34,2))","v":""},{"$f":"IF($C19=\"\",\"\",VLOOKUP($C19,女子ﾃﾞｰﾀ貼付ｼｰﾄ!$A$3:$AA$34,3))","v":""},{"$f":"IF($C19=\"\",\"\",VLOOKUP($C19,女子ﾃﾞｰﾀ貼付ｼｰﾄ!$A$3:$AA$34,4))","v":""},"女",{"$f":"IF($C19=\"\",\"\",RIGHT(VLOOKUP($C19,女子ﾃﾞｰﾀ貼付ｼｰﾄ!$A$3:$AA$34,26),1))","v":""},{"$f":"IF($C19=\"\",\"\",TEXT(VLOOKUP($C19,女子ﾃﾞｰﾀ貼付ｼｰﾄ!$A$3:$AA$34,23),\"yyyy\"))","v":""},{"$f":"IF($C19=\"\",\"\",VLOOKUP($C19,女子ﾃﾞｰﾀ貼付ｼｰﾄ!$A$3:$AA$34,21))","v":""},{"$f":"IF($C19=\"\",\"\",VLOOKUP($C19,女子ﾃﾞｰﾀ貼付ｼｰﾄ!$A$3:$AA$34,17))","v":""},{"$f":"IF($C19=\"\",\"\",VLOOKUP($C19,女子ﾃﾞｰﾀ貼付ｼｰﾄ!$A$3:$AA$34,14))","v":""},null,null,null,null,null,null,null,"",{"$f":"IF(D19=\"\",\"\",VLOOKUP(C19,女子ﾃﾞｰﾀ貼付ｼｰﾄ!$A$3:$AA$202,23))","v":""}]
[13,null,null,{"$f":"IF($C20=\"\",\"\",VLOOKUP($C20,女子ﾃﾞｰﾀ貼付ｼｰﾄ!$A$3:$AA$34,2))","v":""},{"$f":"IF($C20=\"\",\"\",VLOOKUP($C20,女子ﾃﾞｰﾀ貼付ｼｰﾄ!$A$3:$AA$34,3))","v":""},{"$f":"IF($C20=\"\",\"\",VLOOKUP($C20,女子ﾃﾞｰﾀ貼付ｼｰﾄ!$A$3:$AA$34,4))","v":""},"女",{"$f":"IF($C20=\"\",\"\",RIGHT(VLOOKUP($C20,女子ﾃﾞｰﾀ貼付ｼｰﾄ!$A$3:$AA$34,26),1))","v":""},{"$f":"IF($C20=\"\",\"\",TEXT(VLOOKUP($C20,女子ﾃﾞｰﾀ貼付ｼｰﾄ!$A$3:$AA$34,23),\"yyyy\"))","v":""},{"$f":"IF($C20=\"\",\"\",VLOOKUP($C20,女子ﾃﾞｰﾀ貼付ｼｰﾄ!$A$3:$AA$34,21))","v":""},{"$f":"IF($C20=\"\",\"\",VLOOKUP($C20,女子ﾃﾞｰﾀ貼付ｼｰﾄ!$A$3:$AA$34,17))","v":""},{"$f":"IF($C20=\"\",\"\",VLOOKUP($C20,女子ﾃﾞｰﾀ貼付ｼｰﾄ!$A$3:$AA$34,14))","v":""},null,null,null,null,null,null,null,"",{"$f":"IF(D20=\"\",\"\",VLOOKUP(C20,女子ﾃﾞｰﾀ貼付ｼｰﾄ!$A$3:$AA$202,23))","v":""}]
{"$rows_left_out":67}