{"text_format":"1","workbook":"xlsx","n_sheets":5,"sheets":["各団体(個人）申込書記入例(必読)","男子ﾃﾞｰﾀ貼付ｼｰﾄ","【様式1-1】男子団体（個人）申込書 ","女子ﾃﾞｰﾀ貼付ｼｰﾄ","【様式1-2】女子団体（個人）申込書 "],"not_rendered":{"charts":0,"images":3,"macros":1,"external_links":2,"defined_names":12,"comments":4,"pivot_tables":0},"unopened":[],"bounds":{"document_bytes":16777216,"sheet_cells":100000,"rows_first":2000,"rows_last":500,"rows_between":2000,"halvings":0,"cell_chars":16384,"cell_head_chars":4096},"cells_cut":0,"cells_raw":0,"read":"whole","date_system":"1900"}

{"sheet":"各団体(個人）申込書記入例(必読)","index":0,"n_rows":73,"n_cols":24,"rows_kept":73,"cut":false,"hidden":false,"merged":[[72,9,72,10],[71,9,71,10],[69,9,69,10],[68,9,68,10],[67,9,67,10],[50,0,51,0],[50,1,50,2],[50,3,51,3],[50,4,50,5],[50,6,51,6],[50,16,50,20],[50,21,51,21],[62,14,62,15],[47,3,47,10],[47,17,47,20],[48,4,48,15],[50,7,51,7],[50,9,51,9],[64,14,64,15],[66,14,66,15],[68,14,68,15],[70,14,70,15],[50,11,51,11],[50,12,51,12],[50,13,50,15]]}
["競技会参加申込の入力方法"]
[]
[null,"０．","この申込ファイルはマクロを含んでいます。以下の警告が出た場合は、「コンテンツの有効化」をクリックしてください。"]
[]
[]
[]
[]
[]
[]
[]
[null,"１．","「JAAF START」 のページにおいて、「閲覧」 メニューの 「生徒情報確認/変更」 から 「CSVS(新形式2018以降)作成」 をクリックし、CSVファイルを作成する。（一般・学生もこの流れに準ずる）"]
[null,null,"作成したCSVデータを貼り付ける。その際、男子のデータは 「男子ﾃﾞｰﾀ貼付ｼｰﾄ」 に、女子のデータは 「女子ﾃﾞｰﾀ貼付ｼｰﾄ」 に貼り付ける。"]
[null,null,"「都道府県(学連)登録番号」 (もしくはＡ列) が昇順になるように並べ替える。 ( 「ナンバー順に並び替え」 ボタンで並び替えてください。)"]
[]
[]
[]
[]
[]
[]
[]
{"$rows_left_out":54}
{"sheet":"男子ﾃﾞｰﾀ貼付ｼｰﾄ","index":1,"n_rows":201,"n_cols":24,"rows_kept":201,"cut":false,"hidden":false,"merged":[[1,0,1,2]]}
[]
["↓この3列には貼り付けないで！↓",null,null,"JAAF ID","会員名","会員名\nカナ","会員名\n英字(姓)","会員名\n英字(名)","国籍","性\n別","登録都道\n府県コード","登録都道府県名","団体ID","団体名","団体名\nカナ","団体名\n略称","団体名\n略称カナ","生年月日","都道府県(学連)登録番号","旧団体\nコード","備考","学年","団体\n区分","陸連団体"]
[{"$f":"IF(S3=\"\",\"\",S3)","v":""},{"$f":"IF(F3=\"\",\"\",ASC(F3))","v":""},{"$f":"IF(G3=\"\",\"\",G3&\" \"&H3)","v":""}]
["","",""]
["","",""]
["","",""]
["","",""]
["","",""]
["","",""]
["","",""]
["","",""]
["","",""]
["","",""]
["","",""]
["","",""]
["","",""]
["","",""]
["","",""]
["","",""]
["","",""]
{"$rows_left_out":182}
{"sheet":"【様式1-1】男子団体（個人）申込書 ","index":2,"n_rows":67,"n_cols":22,"rows_kept":67,"cut":false,"hidden":false,"merged":[[5,0,6,0],[5,1,5,2],[5,3,6,3],[5,4,6,4],[5,5,6,5],[5,21,6,21],[0,20,0,21],[1,5,1,12],[1,15,1,17],[3,5,3,12],[5,6,6,6],[66,3,66,8],[5,7,6,7],[5,9,6,9],[5,11,6,11],[5,12,5,15],[61,13,61,16],[62,13,62,16],[63,3,63,5],[64,3,64,8],[65,3,65,8],[5,16,5,20]]}
[null,null,null,null,null,null,null,null,null,null,null,null,null,null,null,null,null,null,null,null,"【様式1-1】"]
[null,null,null,"大会名",null,"第６５回北陸地域陸上競技選手権大会",null,null,null,null,null,null,null,null,null,"参加申込一覧表（　男子　）"]
[]
[null,null,null,"所属学校・団体名 ",null,null,null,null,null,null,null,null,null,{"$f":"IF(F4=\"\",\"\",[2]男子ﾃﾞｰﾀ貼付ｼｰﾄ!T3)","v":""}]
[]
[null,"ﾅﾝﾊﾞｰ",null,"氏　名","ﾌﾘｶﾞﾅ\n(半角ｶﾀｶﾅ)","ｱﾙﾌｧﾍﾞｯﾄ表記","性別","学年","生年月日","所属","登録","国籍","各県選手権決勝の記録・順位",null,null,null,"有効期間内の自己最高記録（標準突破記録の記載を含む）",null,null,null,null,"備考"]
[null,"北","県",null,null,null,null,null,"西暦8桁の数字",null,"都道府県",null,"種目","記録","順位","年月(4桁)","記録","順位","年月(4桁)","大会名","場所"]
[1,null,null,{"$f":"IF($C8=\"\",\"\",VLOOKUP($C8,男子ﾃﾞｰﾀ貼付ｼｰﾄ!$A$3:$W$201,5))","v":""},{"$f":"IF($C8=\"\",\"\",VLOOKUP($C8,男子ﾃﾞｰﾀ貼付ｼｰﾄ!$A$3:$W$201,2))","v":""},{"$f":"IF($C8=\"\",\"\",VLOOKUP($C8,男子ﾃﾞｰﾀ貼付ｼｰﾄ!$A$3:$W$201,3))","v":""},"男",{"$f":"IF($C8=\"\",\"\",VLOOKUP($C8,男子ﾃﾞｰﾀ貼付ｼｰﾄ!$A$3:$W$201,22))","v":""},{"$f":"IF($C8=\"\",\"\",VLOOKUP($C8,男子ﾃﾞｰﾀ貼付ｼｰﾄ!$A$3:$W$201,18))","v":""},{"$f":"IF($C8=\"\",\"\",VLOOKUP($C8,男子ﾃﾞｰﾀ貼付ｼｰﾄ!$A$3:$W$201,16))","v":""},{"$f":"IF($C8=\"\",\"\",VLOOKUP($C8,男子ﾃﾞｰﾀ貼付ｼｰﾄ!$A$3:$W$201,12))","v":""},{"$f":"IF($C8=\"\",\"\",VLOOKUP($C8,男子ﾃﾞｰﾀ貼付ｼｰﾄ!$A$3:$W$201,9))","v":""}]
[2,null,null,{"$f":"IF($C9=\"\",\"\",VLOOKUP($C9,男子ﾃﾞｰﾀ貼付ｼｰﾄ!$A$3:$W$201,5))","v":""},{"$f":"IF($C9=\"\",\"\",VLOOKUP($C9,男子ﾃﾞｰﾀ貼付ｼｰﾄ!$A$3:$W$201,2))","v":""},{"$f":"IF($C9=\"\",\"\",VLOOKUP($C9,男子ﾃﾞｰﾀ貼付ｼｰﾄ!$A$3:$W$201,3))","v":""},"男",{"$f":"IF($C9=\"\",\"\",VLOOKUP($C9,男子ﾃﾞｰﾀ貼付ｼｰﾄ!$A$3:$W$201,22))","v":""},{"$f":"IF($C9=\"\",\"\",VLOOKUP($C9,男子ﾃﾞｰﾀ貼付ｼｰﾄ!$A$3:$W$201,18))","v":""},{"$f":"IF($C9=\"\",\"\",VLOOKUP($C9,男子ﾃﾞｰﾀ貼付ｼｰﾄ!$A$3:$W$201,16))","v":""},{"$f":"IF($C9=\"\",\"\",VLOOKUP($C9,男子ﾃﾞｰﾀ貼付ｼｰﾄ!$A$3:$W$201,12))","v":""},{"$f":"IF($C9=\"\",\"\",VLOOKUP($C9,男子ﾃﾞｰﾀ貼付ｼｰﾄ!$A$3:$W$201,9))","v":""}]
[3,null,null,{"$f":"IF($C10=\"\",\"\",VLOOKUP($C10,男子ﾃﾞｰﾀ貼付ｼｰﾄ!$A$3:$W$201,5))","v":""},{"$f":"IF($C10=\"\",\"\",VLOOKUP($C10,男子ﾃﾞｰﾀ貼付ｼｰﾄ!$A$3:$W$201,2))","v":""},{"$f":"IF($C10=\"\",\"\",VLOOKUP($C10,男子ﾃﾞｰﾀ貼付ｼｰﾄ!$A$3:$W$201,3))","v":""},"男",{"$f":"IF($C10=\"\",\"\",VLOOKUP($C10,男子ﾃﾞｰﾀ貼付ｼｰﾄ!$A$3:$W$201,22))","v":""},{"$f":"IF($C10=\"\",\"\",VLOOKUP($C10,男子ﾃﾞｰﾀ貼付ｼｰﾄ!$A$3:$W$201,18))","v":""},{"$f":"IF($C10=\"\",\"\",VLOOKUP($C10,男子ﾃﾞｰﾀ貼付ｼｰﾄ!$A$3:$W$201,16))","v":""},{"$f":"IF($C10=\"\",\"\",VLOOKUP($C10,男子ﾃﾞｰﾀ貼付ｼｰﾄ!$A$3:$W$201,12))","v":""},{"$f":"IF($C10=\"\",\"\",VLOOKUP($C10,男子ﾃﾞｰﾀ貼付ｼｰﾄ!$A$3:$W$201,9))","v":""}]
[4,null,null,{"$f":"IF($C11=\"\",\"\",VLOOKUP($C11,男子ﾃﾞｰﾀ貼付ｼｰﾄ!$A$3:$W$201,5))","v":""},{"$f":"IF($C11=\"\",\"\",VLOOKUP($C11,男子ﾃﾞｰﾀ貼付ｼｰﾄ!$A$3:$W$201,2))","v":""},{"$f":"IF($C11=\"\",\"\",VLOOKUP($C11,男子ﾃﾞｰﾀ貼付ｼｰﾄ!$A$3:$W$201,3))","v":""},"男",{"$f":"IF($C11=\"\",\"\",VLOOKUP($C11,男子ﾃﾞｰﾀ貼付ｼｰﾄ!$A$3:$W$201,22))","v":""},{"$f":"IF($C11=\"\",\"\",VLOOKUP($C11,男子ﾃﾞｰﾀ貼付ｼｰﾄ!$A$3:$W$201,18))","v":""},{"$f":"IF($C11=\"\",\"\",VLOOKUP($C11,男子ﾃﾞｰﾀ貼付ｼｰﾄ!$A$3:$W$201,16))","v":""},{"$f":"IF($C11=\"\",\"\",VLOOKUP($C11,男子ﾃﾞｰﾀ貼付ｼｰﾄ!$A$3:$W$201,12))","v":""},{"$f":"IF($C11=\"\",\"\",VLOOKUP($C11,男子ﾃﾞｰﾀ貼付ｼｰﾄ!$A$3:$W$201,9))","v":""}]
[5,null,null,{"$f":"IF($C12=\"\",\"\",VLOOKUP($C12,男子ﾃﾞｰﾀ貼付ｼｰﾄ!$A$3:$W$201,5))","v":""},{"$f":"IF($C12=\"\",\"\",VLOOKUP($C12,男子ﾃﾞｰﾀ貼付ｼｰﾄ!$A$3:$W$201,2))","v":""},{"$f":"IF($C12=\"\",\"\",VLOOKUP($C12,男子ﾃﾞｰﾀ貼付ｼｰﾄ!$A$3:$W$201,3))","v":""},"男",{"$f":"IF($C12=\"\",\"\",VLOOKUP($C12,男子ﾃﾞｰﾀ貼付ｼｰﾄ!$A$3:$W$201,22))","v":""},{"$f":"IF($C12=\"\",\"\",VLOOKUP($C12,男子ﾃﾞｰﾀ貼付ｼｰﾄ!$A$3:$W$201,18))","v":""},{"$f":"IF($C12=\"\",\"\",VLOOKUP($C12,男子ﾃﾞｰﾀ貼付ｼｰﾄ!$A$3:$W$201,16))","v":""},{"$f":"IF($C12=\"\",\"\",VLOOKUP($C12,男子ﾃﾞｰﾀ貼付ｼｰﾄ!$A$3:$W$201,12))","v":""},{"$f":"IF($C12=\"\",\"\",VLOOKUP($C12,男子ﾃﾞｰﾀ貼付ｼｰﾄ!$A$3:$W$201,9))","v":""}]
[6,null,null,{"$f":"IF($C13=\"\",\"\",VLOOKUP($C13,男子ﾃﾞｰﾀ貼付ｼｰﾄ!$A$3:$W$201,5))","v":""},{"$f":"IF($C13=\"\",\"\",VLOOKUP($C13,男子ﾃﾞｰﾀ貼付ｼｰﾄ!$A$3:$W$201,2))","v":""},{"$f":"IF($C13=\"\",\"\",VLOOKUP($C13,男子ﾃﾞｰﾀ貼付ｼｰﾄ!$A$3:$W$201,3))","v":""},"男",{"$f":"IF($C13=\"\",\"\",VLOOKUP($C13,男子ﾃﾞｰﾀ貼付ｼｰﾄ!$A$3:$W$201,22))","v":""},{"$f":"IF($C13=\"\",\"\",VLOOKUP($C13,男子ﾃﾞｰﾀ貼付ｼｰﾄ!$A$3:$W$201,18))","v":""},{"$f":"IF($C13=\"\",\"\",VLOOKUP($C13,男子ﾃﾞｰﾀ貼付ｼｰﾄ!$A$3:$W$201,16))","v":""},{"$f":"IF($C13=\"\",\"\",VLOOKUP($C13,男子ﾃﾞｰﾀ貼付ｼｰﾄ!$A$3:$W$201,12))","v":""},{"$f":"IF($C13=\"\",\"\",VLOOKUP($C13,男子ﾃﾞｰﾀ貼付ｼｰﾄ!$A$3:$W$201,9))","v":""}]
[7,null,null,{"$f":"IF($C14=\"\",\"\",VLOOKUP($C14,男子ﾃﾞｰﾀ貼付ｼｰﾄ!$A$3:$W$201,5))","v":""},{"$f":"IF($C14=\"\",\"\",VLOOKUP($C14,男子ﾃﾞｰﾀ貼付ｼｰﾄ!$A$3:$W$201,2))","v":""},{"$f":"IF($C14=\"\",\"\",VLOOKUP($C14,男子ﾃﾞｰﾀ貼付ｼｰﾄ!$A$3:$W$201,3))","v":""},"男",{"$f":"IF($C14=\"\",\"\",VLOOKUP($C14,男子ﾃﾞｰﾀ貼付ｼｰﾄ!$A$3:$W$201,22))","v":""},{"$f":"IF($C14=\"\",\"\",VLOOKUP($C14,男子ﾃﾞｰﾀ貼付ｼｰﾄ!$A$3:$W$201,18))","v":""},{"$f":"IF($C14=\"\",\"\",VLOOKUP($C14,男子ﾃﾞｰﾀ貼付ｼｰﾄ!$A$3:$W$201,16))","v":""},{"$f":"IF($C14=\"\",\"\",VLOOKUP($C14,男子ﾃﾞｰﾀ貼付ｼｰﾄ!$A$3:$W$201,12))","v":""},{"$f":"IF($C14=\"\",\"\",VLOOKUP($C14,男子ﾃﾞｰﾀ貼付ｼｰﾄ!$A$3:$W$201,9))","v":""}]
[8,null,null,{"$f":"IF($C15=\"\",\"\",VLOOKUP($C15,男子ﾃﾞｰﾀ貼付ｼｰﾄ!$A$3:$W$201,5))","v":""},{"$f":"IF($C15=\"\",\"\",VLOOKUP($C15,男子ﾃﾞｰﾀ貼付ｼｰﾄ!$A$3:$W$201,2))","v":""},{"$f":"IF($C15=\"\",\"\",VLOOKUP($C15,男子ﾃﾞｰﾀ貼付ｼｰﾄ!$A$3:$W$201,3))","v":""},"男",{"$f":"IF($C15=\"\",\"\",VLOOKUP($C15,男子ﾃﾞｰﾀ貼付ｼｰﾄ!$A$3:$W$201,22))","v":""},{"$f":"IF($C15=\"\",\"\",VLOOKUP($C15,男子ﾃﾞｰﾀ貼付ｼｰﾄ!$A$3:$W$201,18))","v":""},{"$f":"IF($C15=\"\",\"\",VLOOKUP($C15,男子ﾃﾞｰﾀ貼付ｼｰﾄ!$A$3:$W$201,16))","v":""},{"$f":"IF($C15=\"\",\"\",VLOOKUP($C15,男子ﾃﾞｰﾀ貼付ｼｰﾄ!$A$3:$W$201,12))","v":""},{"$f":"IF($C15=\"\",\"\",VLOOKUP($C15,男子ﾃﾞｰﾀ貼付ｼｰﾄ!$A$3:$W$201,9))","v":""}]
[9,null,null,{"$f":"IF($C16=\"\",\"\",VLOOKUP($C16,男子ﾃﾞｰﾀ貼付ｼｰﾄ!$A$3:$W$201,5))","v":""},{"$f":"IF($C16=\"\",\"\",VLOOKUP($C16,男子ﾃﾞｰﾀ貼付ｼｰﾄ!$A$3:$W$201,2))","v":""},{"$f":"IF($C16=\"\",\"\",VLOOKUP($C16,男子ﾃﾞｰﾀ貼付ｼｰﾄ!$A$3:$W$201,3))","v":""},"男",{"$f":"IF($C16=\"\",\"\",VLOOKUP($C16,男子ﾃﾞｰﾀ貼付ｼｰﾄ!$A$3:$W$201,22))","v":""},{"$f":"IF($C16=\"\",\"\",VLOOKUP($C16,男子ﾃﾞｰﾀ貼付ｼｰﾄ!$A$3:$W$201,18))","v":""},{"$f":"IF($C16=\"\",\"\",VLOOKUP($C16,男子ﾃﾞｰﾀ貼付ｼｰﾄ!$A$3:$W$201,16))","v":""},{"$f":"IF($C16=\"\",\"\",VLOOKUP($C16,男子ﾃﾞｰﾀ貼付ｼｰﾄ!$A$3:$W$201,12))","v":""},{"$f":"IF($C16=\"\",\"\",VLOOKUP($C16,男子ﾃﾞｰﾀ貼付ｼｰﾄ!$A$3:$W$201,9))","v":""}]
[10,null,null,{"$f":"IF($C17=\"\",\"\",VLOOKUP($C17,男子ﾃﾞｰﾀ貼付ｼｰﾄ!$A$3:$W$201,5))","v":""},{"$f":"IF($C17=\"\",\"\",VLOOKUP($C17,男子ﾃﾞｰﾀ貼付ｼｰﾄ!$A$3:$W$201,2))","v":""},{"$f":"IF($C17=\"\",\"\",VLOOKUP($C17,男子ﾃﾞｰﾀ貼付ｼｰﾄ!$A$3:$W$201,3))","v":""},"男",{"$f":"IF($C17=\"\",\"\",VLOOKUP($C17,男子ﾃﾞｰﾀ貼付ｼｰﾄ!$A$3:$W$201,22))","v":""},{"$f":"IF($C17=\"\",\"\",VLOOKUP($C17,男子ﾃﾞｰﾀ貼付ｼｰﾄ!$A$3:$W$201,18))","v":""},{"$f":"IF($C17=\"\",\"\",VLOOKUP($C17,男子ﾃﾞｰﾀ貼付ｼｰﾄ!$A$3:$W$201,16))","v":""},{"$f":"IF($C17=\"\",\"\",VLOOKUP($C17,男子ﾃﾞｰﾀ貼付ｼｰﾄ!$A$3:$W$201,12))","v":""},{"$f":"IF($C17=\"\",\"\",VLOOKUP($C17,男子ﾃﾞｰﾀ貼付ｼｰﾄ!$A$3:$W$201,9))","v":""}]
[11,null,null,{"$f":"IF($C18=\"\",\"\",VLOOKUP($C18,男子ﾃﾞｰﾀ貼付ｼｰﾄ!$A$3:$W$201,5))","v":""},{"$f":"IF($C18=\"\",\"\",VLOOKUP($C18,男子ﾃﾞｰﾀ貼付ｼｰﾄ!$A$3:$W$201,2))","v":""},{"$f":"IF($C18=\"\",\"\",VLOOKUP($C18,男子ﾃﾞｰﾀ貼付ｼｰﾄ!$A$3:$W$201,3))","v":""},"男",{"$f":"IF($C18=\"\",\"\",VLOOKUP($C18,男子ﾃﾞｰﾀ貼付ｼｰﾄ!$A$3:$W$201,22))","v":""},{"$f":"IF($C18=\"\",\"\",VLOOKUP($C18,男子ﾃﾞｰﾀ貼付ｼｰﾄ!$A$3:$W$201,18))","v":""},{"$f":"IF($C18=\"\",\"\",VLOOKUP($C18,男子ﾃﾞｰﾀ貼付ｼｰﾄ!$A$3:$W$201,16))","v":""},{"$f":"IF($C18=\"\",\"\",VLOOKUP($C18,男子ﾃﾞｰﾀ貼付ｼｰﾄ!$A$3:$W$201,12))","v":""},{"$f":"IF($C18=\"\",\"\",VLOOKUP($C18,男子ﾃﾞｰﾀ貼付ｼｰﾄ!$A$3:$W$201,9))","v":""}]
[12,null,null,{"$f":"IF($C19=\"\",\"\",VLOOKUP($C19,男子ﾃﾞｰﾀ貼付ｼｰﾄ!$A$3:$W$201,5))","v":""},{"$f":"IF($C19=\"\",\"\",VLOOKUP($C19,男子ﾃﾞｰﾀ貼付ｼｰﾄ!$A$3:$W$201,2))","v":""},{"$f":"IF($C19=\"\",\"\",VLOOKUP($C19,男子ﾃﾞｰﾀ貼付ｼｰﾄ!$A$3:$W$201,3))","v":""},"男",{"$f":"IF($C19=\"\",\"\",VLOOKUP($C19,男子ﾃﾞｰﾀ貼付ｼｰﾄ!$A$3:$W$201,22))","v":""},{"$f":"IF($C19=\"\",\"\",VLOOKUP($C19,男子ﾃﾞｰﾀ貼付ｼｰﾄ!$A$3:$W$201,18))","v":""},{"$f":"IF($C19=\"\",\"\",VLOOKUP($C19,男子ﾃﾞｰﾀ貼付ｼｰﾄ!$A$3:$W$201,16))","v":""},{"$f":"IF($C19=\"\",\"\",VLOOKUP($C19,男子ﾃﾞｰﾀ貼付ｼｰﾄ!$A$3:$W$201,12))","v":""},{"$f":"IF($C19=\"\",\"\",VLOOKUP($C19,男子ﾃﾞｰﾀ貼付ｼｰﾄ!$A$3:$W$201,9))","v":""}]
[13,null,null,{"$f":"IF($C20=\"\",\"\",VLOOKUP($C20,男子ﾃﾞｰﾀ貼付ｼｰﾄ!$A$3:$W$201,5))","v":""},{"$f":"IF($C20=\"\",\"\",VLOOKUP($C20,男子ﾃﾞｰﾀ貼付ｼｰﾄ!$A$3:$W$201,2))","v":""},{"$f":"IF($C20=\"\",\"\",VLOOKUP($C20,男子ﾃﾞｰﾀ貼付ｼｰﾄ!$A$3:$W$201,3))","v":""},"男",{"$f":"IF($C20=\"\",\"\",VLOOKUP($C20,男子ﾃﾞｰﾀ貼付ｼｰﾄ!$A$3:$W$201,22))","v":""},{"$f":"IF($C20=\"\",\"\",VLOOKUP($C20,男子ﾃﾞｰﾀ貼付ｼｰﾄ!$A$3:$W$201,18))","v":""},{"$f":"IF($C20=\"\",\"\",VLOOKUP($C20,男子ﾃﾞｰﾀ貼付ｼｰﾄ!$A$3:$W$201,16))","v":""},{"$f":"IF($C20=\"\",\"\",VLOOKUP($C20,男子ﾃﾞｰﾀ貼付ｼｰﾄ!$A$3:$W$201,12))","v":""},{"$f":"IF($C20=\"\",\"\",VLOOKUP($C20,男子ﾃﾞｰﾀ貼付ｼｰﾄ!$A$3:$W$201,9))","v":""}]
{"$rows_left_out":48}
{"sheet":"女子ﾃﾞｰﾀ貼付ｼｰﾄ","index":3,"n_rows":201,"n_cols":24,"rows_kept":201,"cut":false,"hidden":false,"merged":[[1,0,1,2]]}
[]
["↓この3列には貼り付けないで！↓",null,null,"JAAF ID","会員名","会員名\nカナ","会員名\n英字(姓)","会員名\n英字(名)","国籍","性\n別","登録都道\n府県コード","登録都道\n府県名","団体ID","団体名","団体名\nカナ","団体名\n略称","団体名\n略称カナ","生年月日","都道府県(学連)登録番号","旧団体\nコード","備考","学年","団体\n区分","陸連団体"]
[{"$f":"IF(S3=\"\",\"\",S3)","v":""},{"$f":"IF(F3=\"\",\"\",ASC(F3))","v":""},{"$f":"IF(G3=\"\",\"\",G3&\" \"&H3)","v":""}]
["","",""]
["","",""]
["","",""]
["","",""]
["","",""]
["","",""]
["","",""]
["","",""]
["","",""]
["","",""]
["","",""]
["","",""]
["","",""]
["","",""]
["","",""]
["","",""]
["","",""]
{"$rows_left_out":182}
{"sheet":"【様式1-2】女子団体（個人）申込書 ","index":4,"n_rows":68,"n_cols":22,"rows_kept":68,"cut":false,"hidden":false,"merged":[[5,0,6,0],[5,1,5,2],[5,3,6,3],[5,4,6,4],[5,5,6,5],[5,21,6,21],[0,20,0,21],[1,5,1,12],[1,15,1,17],[3,5,3,12],[5,6,6,6],[67,3,67,8],[5,7,6,7],[5,9,6,9],[5,11,6,11],[5,12,5,15],[61,13,61,16],[62,13,62,16],[64,3,64,4],[65,3,65,8],[66,3,66,8],[5,16,5,20]]}
[null,null,null,null,null,null,null,null,null,null,null,null,null,null,null,null,null,null,null,null,"【様式1-2】"]
[null,null,null,"大会名",null,"第６５回北陸地域陸上競技選手権大会",null,null,null,null,null,null,null,null,null,"参加申込一覧表（　女子　）"]
[]
[null,null,null,"所属学校・団体名 ",null,null,null,null,null,null,null,null,null,{"$f":"IF(F4=\"\",\"\",[2]女子ﾃﾞｰﾀ貼付ｼｰﾄ!T3)","v":""}]
[]
[null,"ﾅﾝﾊﾞｰ",null,"氏　名","ﾌﾘｶﾞﾅ\n(半角ｶﾀｶﾅ)","ｱﾙﾌｧﾍﾞｯﾄ表記","性別","学年","生年月日","所属","登録","国籍","各県選手権決勝の記録・順位",null,null,null,"有効期間内の自己最高記録（標準突破記録の記載を含む）",null,null,null,null,"備考"]
[null,"北","県",null,null,null,null,null,"西暦8桁の数字",null,"都道府県",null,"種目","記録","順位","年月(4桁)","記録","順位","年月(4桁)","大会名","場所"]
[1,null,null,{"$f":"IF($C8=\"\",\"\",VLOOKUP($C8,女子ﾃﾞｰﾀ貼付ｼｰﾄ!$A$3:$W$201,5))","v":""},{"$f":"IF($C8=\"\",\"\",VLOOKUP($C8,女子ﾃﾞｰﾀ貼付ｼｰﾄ!$A$3:$W$201,2))","v":""},{"$f":"IF($C8=\"\",\"\",VLOOKUP($C8,女子ﾃﾞｰﾀ貼付ｼｰﾄ!$A$3:$W$201,3))","v":""},"女",{"$f":"IF($C8=\"\",\"\",VLOOKUP($C8,女子ﾃﾞｰﾀ貼付ｼｰﾄ!$A$3:$W$201,22))","v":""},{"$f":"IF($C8=\"\",\"\",VLOOKUP($C8,女子ﾃﾞｰﾀ貼付ｼｰﾄ!$A$3:$W$201,18))","v":""},{"$f":"IF($C8=\"\",\"\",VLOOKUP($C8,女子ﾃﾞｰﾀ貼付ｼｰﾄ!$A$3:$W$201,16))","v":""},{"$f":"IF($C8=\"\",\"\",VLOOKUP($C8,女子ﾃﾞｰﾀ貼付ｼｰﾄ!$A$3:$W$201,12))","v":""},{"$f":"IF($C8=\"\",\"\",VLOOKUP($C8,女子ﾃﾞｰﾀ貼付ｼｰﾄ!$A$3:$W$201,9))","v":""}]
[2,null,null,{"$f":"IF($C9=\"\",\"\",VLOOKUP($C9,女子ﾃﾞｰﾀ貼付ｼｰﾄ!$A$3:$W$201,5))","v":""},{"$f":"IF($C9=\"\",\"\",VLOOKUP($C9,女子ﾃﾞｰﾀ貼付ｼｰﾄ!$A$3:$W$201,2))","v":""},{"$f":"IF($C9=\"\",\"\",VLOOKUP($C9,女子ﾃﾞｰﾀ貼付ｼｰﾄ!$A$3:$W$201,3))","v":""},"女",{"$f":"IF($C9=\"\",\"\",VLOOKUP($C9,女子ﾃﾞｰﾀ貼付ｼｰﾄ!$A$3:$W$201,22))","v":""},{"$f":"IF($C9=\"\",\"\",VLOOKUP($C9,女子ﾃﾞｰﾀ貼付ｼｰﾄ!$A$3:$W$201,18))","v":""},{"$f":"IF($C9=\"\",\"\",VLOOKUP($C9,女子ﾃﾞｰﾀ貼付ｼｰﾄ!$A$3:$W$201,16))","v":""},{"$f":"IF($C9=\"\",\"\",VLOOKUP($C9,女子ﾃﾞｰﾀ貼付ｼｰﾄ!$A$3:$W$201,12))","v":""},{"$f":"IF($C9=\"\",\"\",VLOOKUP($C9,女子ﾃﾞｰﾀ貼付ｼｰﾄ!$A$3:$W$201,9))","v":""}]
[3,null,null,{"$f":"IF($C10=\"\",\"\",VLOOKUP($C10,女子ﾃﾞｰﾀ貼付ｼｰﾄ!$A$3:$W$201,5))","v":""},{"$f":"IF($C10=\"\",\"\",VLOOKUP($C10,女子ﾃﾞｰﾀ貼付ｼｰﾄ!$A$3:$W$201,2))","v":""},{"$f":"IF($C10=\"\",\"\",VLOOKUP($C10,女子ﾃﾞｰﾀ貼付ｼｰﾄ!$A$3:$W$201,3))","v":""},"女",{"$f":"IF($C10=\"\",\"\",VLOOKUP($C10,女子ﾃﾞｰﾀ貼付ｼｰﾄ!$A$3:$W$201,22))","v":""},{"$f":"IF($C10=\"\",\"\",VLOOKUP($C10,女子ﾃﾞｰﾀ貼付ｼｰﾄ!$A$3:$W$201,18))","v":""},{"$f":"IF($C10=\"\",\"\",VLOOKUP($C10,女子ﾃﾞｰﾀ貼付ｼｰﾄ!$A$3:$W$201,16))","v":""},{"$f":"IF($C10=\"\",\"\",VLOOKUP($C10,女子ﾃﾞｰﾀ貼付ｼｰﾄ!$A$3:$W$201,12))","v":""},{"$f":"IF($C10=\"\",\"\",VLOOKUP($C10,女子ﾃﾞｰﾀ貼付ｼｰﾄ!$A$3:$W$201,9))","v":""}]
[4,null,null,{"$f":"IF($C11=\"\",\"\",VLOOKUP($C11,女子ﾃﾞｰﾀ貼付ｼｰﾄ!$A$3:$W$201,5))","v":""},{"$f":"IF($C11=\"\",\"\",VLOOKUP($C11,女子ﾃﾞｰﾀ貼付ｼｰﾄ!$A$3:$W$201,2))","v":""},{"$f":"IF($C11=\"\",\"\",VLOOKUP($C11,女子ﾃﾞｰﾀ貼付ｼｰﾄ!$A$3:$W$201,3))","v":""},"女",{"$f":"IF($C11=\"\",\"\",VLOOKUP($C11,女子ﾃﾞｰﾀ貼付ｼｰﾄ!$A$3:$W$201,22))","v":""},{"$f":"IF($C11=\"\",\"\",VLOOKUP($C11,女子ﾃﾞｰﾀ貼付ｼｰﾄ!$A$3:$W$201,18))","v":""},{"$f":"IF($C11=\"\",\"\",VLOOKUP($C11,女子ﾃﾞｰﾀ貼付ｼｰﾄ!$A$3:$W$201,16))","v":""},{"$f":"IF($C11=\"\",\"\",VLOOKUP($C11,女子ﾃﾞｰﾀ貼付ｼｰﾄ!$A$3:$W$201,12))","v":""},{"$f":"IF($C11=\"\",\"\",VLOOKUP($C11,女子ﾃﾞｰﾀ貼付ｼｰﾄ!$A$3:$W$201,9))","v":""}]
[5,null,null,{"$f":"IF($C12=\"\",\"\",VLOOKUP($C12,女子ﾃﾞｰﾀ貼付ｼｰﾄ!$A$3:$W$201,5))","v":""},{"$f":"IF($C12=\"\",\"\",VLOOKUP($C12,女子ﾃﾞｰﾀ貼付ｼｰﾄ!$A$3:$W$201,2))","v":""},{"$f":"IF($C12=\"\",\"\",VLOOKUP($C12,女子ﾃﾞｰﾀ貼付ｼｰﾄ!$A$3:$W$201,3))","v":""},"女",{"$f":"IF($C12=\"\",\"\",VLOOKUP($C12,女子ﾃﾞｰﾀ貼付ｼｰﾄ!$A$3:$W$201,22))","v":""},{"$f":"IF($C12=\"\",\"\",VLOOKUP($C12,女子ﾃﾞｰﾀ貼付ｼｰﾄ!$A$3:$W$201,18))","v":""},{"$f":"IF($C12=\"\",\"\",VLOOKUP($C12,女子ﾃﾞｰﾀ貼付ｼｰﾄ!$A$3:$W$201,16))","v":""},{"$f":"IF($C12=\"\",\"\",VLOOKUP($C12,女子ﾃﾞｰﾀ貼付ｼｰﾄ!$A$3:$W$201,12))","v":""},{"$f":"IF($C12=\"\",\"\",VLOOKUP($C12,女子ﾃﾞｰﾀ貼付ｼｰﾄ!$A$3:$W$201,9))","v":""}]
[6,null,null,{"$f":"IF($C13=\"\",\"\",VLOOKUP($C13,女子ﾃﾞｰﾀ貼付ｼｰﾄ!$A$3:$W$201,5))","v":""},{"$f":"IF($C13=\"\",\"\",VLOOKUP($C13,女子ﾃﾞｰﾀ貼付ｼｰﾄ!$A$3:$W$201,2))","v":""},{"$f":"IF($C13=\"\",\"\",VLOOKUP($C13,女子ﾃﾞｰﾀ貼付ｼｰﾄ!$A$3:$W$201,3))","v":""},"女",{"$f":"IF($C13=\"\",\"\",VLOOKUP($C13,女子ﾃﾞｰﾀ貼付ｼｰﾄ!$A$3:$W$201,22))","v":""},{"$f":"IF($C13=\"\",\"\",VLOOKUP($C13,女子ﾃﾞｰﾀ貼付ｼｰﾄ!$A$3:$W$201,18))","v":""},{"$f":"IF($C13=\"\",\"\",VLOOKUP($C13,女子ﾃﾞｰﾀ貼付ｼｰﾄ!$A$3:$W$201,16))","v":""},{"$f":"IF($C13=\"\",\"\",VLOOKUP($C13,女子ﾃﾞｰﾀ貼付ｼｰﾄ!$A$3:$W$201,12))","v":""},{"$f":"IF($C13=\"\",\"\",VLOOKUP($C13,女子ﾃﾞｰﾀ貼付ｼｰﾄ!$A$3:$W$201,9))","v":""}]
[7,null,null,{"$f":"IF($C14=\"\",\"\",VLOOKUP($C14,女子ﾃﾞｰﾀ貼付ｼｰﾄ!$A$3:$W$201,5))","v":""},{"$f":"IF($C14=\"\",\"\",VLOOKUP($C14,女子ﾃﾞｰﾀ貼付ｼｰﾄ!$A$3:$W$201,2))","v":""},{"$f":"IF($C14=\"\",\"\",VLOOKUP($C14,女子ﾃﾞｰﾀ貼付ｼｰﾄ!$A$3:$W$201,3))","v":""},"女",{"$f":"IF($C14=\"\",\"\",VLOOKUP($C14,女子ﾃﾞｰﾀ貼付ｼｰﾄ!$A$3:$W$201,22))","v":""},{"$f":"IF($C14=\"\",\"\",VLOOKUP($C14,女子ﾃﾞｰﾀ貼付ｼｰﾄ!$A$3:$W$201,18))","v":""},{"$f":"IF($C14=\"\",\"\",VLOOKUP($C14,女子ﾃﾞｰﾀ貼付ｼｰﾄ!$A$3:$W$201,16))","v":""},{"$f":"IF($C14=\"\",\"\",VLOOKUP($C14,女子ﾃﾞｰﾀ貼付ｼｰﾄ!$A$3:$W$201,12))","v":""},{"$f":"IF($C14=\"\",\"\",VLOOKUP($C14,女子ﾃﾞｰﾀ貼付ｼｰﾄ!$A$3:$W$201,9))","v":""}]
[8,null,null,{"$f":"IF($C15=\"\",\"\",VLOOKUP($C15,女子ﾃﾞｰﾀ貼付ｼｰﾄ!$A$3:$W$201,5))","v":""},{"$f":"IF($C15=\"\",\"\",VLOOKUP($C15,女子ﾃﾞｰﾀ貼付ｼｰﾄ!$A$3:$W$201,2))","v":""},{"$f":"IF($C15=\"\",\"\",VLOOKUP($C15,女子ﾃﾞｰﾀ貼付ｼｰﾄ!$A$3:$W$201,3))","v":""},"女",{"$f":"IF($C15=\"\",\"\",VLOOKUP($C15,女子ﾃﾞｰﾀ貼付ｼｰﾄ!$A$3:$W$201,22))","v":""},{"$f":"IF($C15=\"\",\"\",VLOOKUP($C15,女子ﾃﾞｰﾀ貼付ｼｰﾄ!$A$3:$W$201,18))","v":""},{"$f":"IF($C15=\"\",\"\",VLOOKUP($C15,女子ﾃﾞｰﾀ貼付ｼｰﾄ!$A$3:$W$201,16))","v":""},{"$f":"IF($C15=\"\",\"\",VLOOKUP($C15,女子ﾃﾞｰﾀ貼付ｼｰﾄ!$A$3:$W$201,12))","v":""},{"$f":"IF($C15=\"\",\"\",VLOOKUP($C15,女子ﾃﾞｰﾀ貼付ｼｰﾄ!$A$3:$W$201,9))","v":""}]
[9,null,null,{"$f":"IF($C16=\"\",\"\",VLOOKUP($C16,女子ﾃﾞｰﾀ貼付ｼｰﾄ!$A$3:$W$201,5))","v":""},{"$f":"IF($C16=\"\",\"\",VLOOKUP($C16,女子ﾃﾞｰﾀ貼付ｼｰﾄ!$A$3:$W$201,2))","v":""},{"$f":"IF($C16=\"\",\"\",VLOOKUP($C16,女子ﾃﾞｰﾀ貼付ｼｰﾄ!$A$3:$W$201,3))","v":""},"女",{"$f":"IF($C16=\"\",\"\",VLOOKUP($C16,女子ﾃﾞｰﾀ貼付ｼｰﾄ!$A$3:$W$201,22))","v":""},{"$f":"IF($C16=\"\",\"\",VLOOKUP($C16,女子ﾃﾞｰﾀ貼付ｼｰﾄ!$A$3:$W$201,18))","v":""},{"$f":"IF($C16=\"\",\"\",VLOOKUP($C16,女子ﾃﾞｰﾀ貼付ｼｰﾄ!$A$3:$W$201,16))","v":""},{"$f":"IF($C16=\"\",\"\",VLOOKUP($C16,女子ﾃﾞｰﾀ貼付ｼｰﾄ!$A$3:$W$201,12))","v":""},{"$f":"IF($C16=\"\",\"\",VLOOKUP($C16,女子ﾃﾞｰﾀ貼付ｼｰﾄ!$A$3:$W$201,9))","v":""}]
[10,null,null,{"$f":"IF($C17=\"\",\"\",VLOOKUP($C17,女子ﾃﾞｰﾀ貼付ｼｰﾄ!$A$3:$W$201,5))","v":""},{"$f":"IF($C17=\"\",\"\",VLOOKUP($C17,女子ﾃﾞｰﾀ貼付ｼｰﾄ!$A$3:$W$201,2))","v":""},{"$f":"IF($C17=\"\",\"\",VLOOKUP($C17,女子ﾃﾞｰﾀ貼付ｼｰﾄ!$A$3:$W$201,3))","v":""},"女",{"$f":"IF($C17=\"\",\"\",VLOOKUP($C17,女子ﾃﾞｰﾀ貼付ｼｰﾄ!$A$3:$W$201,22))","v":""},{"$f":"IF($C17=\"\",\"\",VLOOKUP($C17,女子ﾃﾞｰﾀ貼付ｼｰﾄ!$A$3:$W$201,18))","v":""},{"$f":"IF($C17=\"\",\"\",VLOOKUP($C17,女子ﾃﾞｰﾀ貼付ｼｰﾄ!$A$3:$W$201,16))","v":""},{"$f":"IF($C17=\"\",\"\",VLOOKUP($C17,女子ﾃﾞｰﾀ貼付ｼｰﾄ!$A$3:$W$201,12))","v":""},{"$f":"IF($C17=\"\",\"\",VLOOKUP($C17,女子ﾃﾞｰﾀ貼付ｼｰﾄ!$A$3:$W$201,9))","v":""}]
[11,null,null,{"$f":"IF($C18=\"\",\"\",VLOOKUP($C18,女子ﾃﾞｰﾀ貼付ｼｰﾄ!$A$3:$W$201,5))","v":""},{"$f":"IF($C18=\"\",\"\",VLOOKUP($C18,女子ﾃﾞｰﾀ貼付ｼｰﾄ!$A$3:$W$201,2))","v":""},{"$f":"IF($C18=\"\",\"\",VLOOKUP($C18,女子ﾃﾞｰﾀ貼付ｼｰﾄ!$A$3:$W$201,3))","v":""},"女",{"$f":"IF($C18=\"\",\"\",VLOOKUP($C18,女子ﾃﾞｰﾀ貼付ｼｰﾄ!$A$3:$W$201,22))","v":""},{"$f":"IF($C18=\"\",\"\",VLOOKUP($C18,女子ﾃﾞｰﾀ貼付ｼｰﾄ!$A$3:$W$201,18))","v":""},{"$f":"IF($C18=\"\",\"\",VLOOKUP($C18,女子ﾃﾞｰﾀ貼付ｼｰﾄ!$A$3:$W$201,16))","v":""},{"$f":"IF($C18=\"\",\"\",VLOOKUP($C18,女子ﾃﾞｰﾀ貼付ｼｰﾄ!$A$3:$W$201,12))","v":""},{"$f":"IF($C18=\"\",\"\",VLOOKUP($C18,女子ﾃﾞｰﾀ貼付ｼｰﾄ!$A$3:$W$201,9))","v":""}]
[12,null,null,{"$f":"IF($C19=\"\",\"\",VLOOKUP($C19,女子ﾃﾞｰﾀ貼付ｼｰﾄ!$A$3:$W$201,5))","v":""},{"$f":"IF($C19=\"\",\"\",VLOOKUP($C19,女子ﾃﾞｰﾀ貼付ｼｰﾄ!$A$3:$W$201,2))","v":""},{"$f":"IF($C19=\"\",\"\",VLOOKUP($C19,女子ﾃﾞｰﾀ貼付ｼｰﾄ!$A$3:$W$201,3))","v":""},"女",{"$f":"IF($C19=\"\",\"\",VLOOKUP($C19,女子ﾃﾞｰﾀ貼付ｼｰﾄ!$A$3:$W$201,22))","v":""},{"$f":"IF($C19=\"\",\"\",VLOOKUP($C19,女子ﾃﾞｰﾀ貼付ｼｰﾄ!$A$3:$W$201,18))","v":""},{"$f":"IF($C19=\"\",\"\",VLOOKUP($C19,女子ﾃﾞｰﾀ貼付ｼｰﾄ!$A$3:$W$201,16))","v":""},{"$f":"IF($C19=\"\",\"\",VLOOKUP($C19,女子ﾃﾞｰﾀ貼付ｼｰﾄ!$A$3:$W$201,12))","v":""},{"$f":"IF($C19=\"\",\"\",VLOOKUP($C19,女子ﾃﾞｰﾀ貼付ｼｰﾄ!$A$3:$W$201,9))","v":""}]
[13,null,null,{"$f":"IF($C20=\"\",\"\",VLOOKUP($C20,女子ﾃﾞｰﾀ貼付ｼｰﾄ!$A$3:$W$201,5))","v":""},{"$f":"IF($C20=\"\",\"\",VLOOKUP($C20,女子ﾃﾞｰﾀ貼付ｼｰﾄ!$A$3:$W$201,2))","v":""},{"$f":"IF($C20=\"\",\"\",VLOOKUP($C20,女子ﾃﾞｰﾀ貼付ｼｰﾄ!$A$3:$W$201,3))","v":""},"女",{"$f":"IF($C20=\"\",\"\",VLOOKUP($C20,女子ﾃﾞｰﾀ貼付ｼｰﾄ!$A$3:$W$201,22))","v":""},{"$f":"IF($C20=\"\",\"\",VLOOKUP($C20,女子ﾃﾞｰﾀ貼付ｼｰﾄ!$A$3:$W$201,18))","v":""},{"$f":"IF($C20=\"\",\"\",VLOOKUP($C20,女子ﾃﾞｰﾀ貼付ｼｰﾄ!$A$3:$W$201,16))","v":""},{"$f":"IF($C20=\"\",\"\",VLOOKUP($C20,女子ﾃﾞｰﾀ貼付ｼｰﾄ!$A$3:$W$201,12))","v":""},{"$f":"IF($C20=\"\",\"\",VLOOKUP($C20,女子ﾃﾞｰﾀ貼付ｼｰﾄ!$A$3:$W$201,9))","v":""}]
{"$rows_left_out":48}