{"text_format":"1","workbook":"xlsx","n_sheets":8,"sheets":["大会要項（新潟県用）","各団体(個人）申込書記入例(必読)","男子ﾃﾞｰﾀ貼付ｼｰﾄ","【様式1-1】男子団体（個人）申込書","女子ﾃﾞｰﾀ貼付ｼｰﾄ","【様式1-2】女子団体（個人）申込書","【様式5-1】2020年宿泊要項","【様式5-2】2020年宿泊申込書"],"not_rendered":{"charts":0,"images":3,"macros":1,"external_links":1,"defined_names":15,"comments":4,"pivot_tables":0},"unopened":[],"bounds":{"document_bytes":16777216,"sheet_cells":100000,"rows_first":2000,"rows_last":500,"rows_between":2000,"halvings":0,"cell_chars":16384,"cell_head_chars":4096},"cells_cut":0,"cells_raw":0,"read":"whole","date_system":"1900"}

{"sheet":"大会要項（新潟県用）","index":0,"n_rows":85,"n_cols":15,"rows_kept":85,"cut":false,"hidden":false,"merged":[[0,0,0,14],[1,0,1,14],[27,2,28,15],[38,2,39,16],[48,2,49,16],[45,2,45,16],[40,2,43,16]]}
["第６４回 北 陸 陸 上 競 技 選 手 権 大 会 要 項"]
["兼 第１０５回日本陸上競技選手権大会北陸地域予選会"]
[]
["１主　　催",null,"北陸陸上競技協会"]
[]
["２後　　援",null,"新潟県　新潟県教育委員会　長岡市　長岡市教育委員会　公益財団法人新潟県スポーツ協会　各県高等学校体育連盟"]
[]
["３主　　管",null,"一般財団法人新潟陸上競技協会"]
[]
["４期　　日",null,"２０２０年８月２２日（土）９時００分：競技開始　　２３日（日）９時００分：競技開始"]
[]
["５会　　場",null,"長岡市営陸上競技場（〒940-2105　長岡市緑町１丁目５番地１　℡0258-27-6300）"]
[]
["６競技種目",null,"男子　８月２２日（土）２００ｍ、８００ｍ、５０００ｍ、４００ｍＨ，３０００ｍＳＣ、５０００ｍＷ"]
["　・実施日",null,"　　　（１１種目）　　棒高跳、走幅跳、ハンマー投、やり投、十種競技（第一日目）"]
{"$rows_left_out":71}
{"sheet":"各団体(個人）申込書記入例(必読)","index":1,"n_rows":73,"n_cols":22,"rows_kept":73,"cut":false,"hidden":false,"merged":[[58,16,58,18],[53,16,53,18],[54,16,54,18],[55,16,55,18],[56,16,56,18],[57,16,57,18],[70,14,70,15],[62,14,62,15],[64,14,64,15],[66,14,66,15],[68,14,68,15],[59,16,59,18],[60,16,60,18],[50,21,51,21],[50,0,51,0],[50,3,51,3],[50,1,50,2],[57,19,57,20],[58,19,58,20],[59,19,59,20],[60,19,60,20],[52,16,52,18],[52,19,52,20],[53,19,53,20],[54,19,54,20],[55,19,55,20],[56,19,56,20],[47,3,47,10],[47,17,47,20],[48,4,48,15],[50,6,51,6],[50,11,51,11],[50,12,51,12],[50,4,50,5],[50,7,51,7],[50,9,51,9],[51,16,51,18],[50,13,50,20],[51,19,51,20]]}
["競技会参加申込の入力方法"]
[]
[null,"０．","この申込ファイルはマクロを含んでいます。以下の警告が出た場合は、「コンテンツの有効化」をクリックしてください。"]
[]
[]
[]
[]
[]
[]
[]
[null,"１．","「JAAF START」 のページにおいて、「閲覧」 メニューの 「生徒情報確認/変更」 から 「CSVS(新形式2018以降)作成」 をクリックし、CSVファイルを作成する。"]
[null,null,"作成したCSVデータを貼り付ける。その際、男子のデータは 「男子ﾃﾞｰﾀ貼付ｼｰﾄ」 に、女子のデータは 「女子ﾃﾞｰﾀ貼付ｼｰﾄ」 に貼り付ける。"]
[null,null,"「都道府県(学連)登録番号」 (もしくはＡ列) が昇順になるように並べ替える。 ( 「ナンバー順に並び替え」 ボタンで並び替えてください。)"]
[]
[]
{"$rows_left_out":59}
{"sheet":"男子ﾃﾞｰﾀ貼付ｼｰﾄ","index":2,"n_rows":201,"n_cols":22,"rows_kept":201,"cut":false,"hidden":false,"merged":[[1,0,1,2]]}
[]
["↓この3列には貼り付けないで！↓",null,null,"JAAF ID","会員名","会員名\nカナ","会員名\n英字(姓)","会員名\n英字(名)","国籍","性\n別","登録都道\n府県コード","登録       都道府    県名","団体ID","団体名","団体名\nカナ","団体名\n略称","団体名\n略称カナ","生年月日","都道府県 (学連)     登録番号","旧団体\nコード","備考","学年"]
[{"$f":"IF(S3=\"\",\"\",S3)","v":""},{"$f":"IF(F3=\"\",\"\",ASC(F3))","v":""},{"$f":"IF(G3=\"\",\"\",G3&\" \"&H3)","v":""}]
["","",""]
["","",""]
["","",""]
["","",""]
["","",""]
["","",""]
["","",""]
["","",""]
["","",""]
["","",""]
["","",""]
["","",""]
{"$rows_left_out":187}
{"sheet":"【様式1-1】男子団体（個人）申込書","index":3,"n_rows":67,"n_cols":19,"rows_kept":67,"cut":false,"hidden":false,"merged":[[5,0,6,0],[5,1,5,2],[5,3,6,3],[5,5,6,5],[5,6,6,6],[5,4,6,4],[0,17,0,18],[65,3,65,8],[66,3,66,8],[5,12,6,12],[63,3,63,5],[64,3,64,8],[5,18,6,18],[1,15,1,17],[5,13,5,17],[61,13,61,16],[62,13,62,16],[1,5,1,12],[3,5,3,12],[5,7,6,7],[5,9,6,9],[5,11,6,11]]}
[null,null,null,null,null,null,null,null,null,null,null,null,null,null,null,null,null,"【様式1-1】"]
[null,null,null,"大会名",null,"第６４回北陸地域陸上競技選手権大会",null,null,null,null,null,null,null,null,null,"参加申込一覧表（　男子　）"]
[]
[null,null,null,"所属学校・団体名 ",null,null,null,null,null,null,null,null,null,{"$f":"IF(F4=\"\",\"\",男子ﾃﾞｰﾀ貼付ｼｰﾄ!T3)","v":""}]
[]
[null,"ﾅﾝﾊﾞｰ",null,"氏　名","ﾌﾘｶﾞﾅ\n(半角ｶﾀｶﾅ)","ｱﾙﾌｧﾍﾞｯﾄ表記","性別","学年","生年月日","所属","登録","国籍","種目","参加標準記録",null,null,null,null,"備考"]
[null,"北","県",null,null,null,null,null,"西暦8桁の数字",null,"都道府県",null,null,"記録","順位","年月(4桁)","大会名","場所"]
[1,null,null,{"$f":"IF($C8=\"\",\"\",VLOOKUP($C8,男子ﾃﾞｰﾀ貼付ｼｰﾄ!$A$3:$V$201,5))","v":""},{"$f":"IF($C8=\"\",\"\",VLOOKUP($C8,男子ﾃﾞｰﾀ貼付ｼｰﾄ!$A$3:$V$201,2))","v":""},{"$f":"IF($C8=\"\",\"\",VLOOKUP($C8,男子ﾃﾞｰﾀ貼付ｼｰﾄ!$A$3:$V$201,3))","v":""},"男",{"$f":"IF($C8=\"\",\"\",VLOOKUP($C8,男子ﾃﾞｰﾀ貼付ｼｰﾄ!$A$3:$V$201,22))","v":""},{"$f":"IF($C8=\"\",\"\",VLOOKUP($C8,男子ﾃﾞｰﾀ貼付ｼｰﾄ!$A$3:$V$201,18))","v":""},{"$f":"IF($C8=\"\",\"\",VLOOKUP($C8,男子ﾃﾞｰﾀ貼付ｼｰﾄ!$A$3:$V$201,16))","v":""},{"$f":"IF($C8=\"\",\"\",VLOOKUP($C8,男子ﾃﾞｰﾀ貼付ｼｰﾄ!$A$3:$V$201,12))","v":""},{"$f":"IF($C8=\"\",\"\",VLOOKUP($C8,男子ﾃﾞｰﾀ貼付ｼｰﾄ!$A$3:$V$201,9))","v":""}]
[2,null,null,{"$f":"IF($C9=\"\",\"\",VLOOKUP($C9,男子ﾃﾞｰﾀ貼付ｼｰﾄ!$A$3:$V$201,5))","v":""},{"$f":"IF($C9=\"\",\"\",VLOOKUP($C9,男子ﾃﾞｰﾀ貼付ｼｰﾄ!$A$3:$V$201,2))","v":""},{"$f":"IF($C9=\"\",\"\",VLOOKUP($C9,男子ﾃﾞｰﾀ貼付ｼｰﾄ!$A$3:$V$201,3))","v":""},"男",{"$f":"IF($C9=\"\",\"\",VLOOKUP($C9,男子ﾃﾞｰﾀ貼付ｼｰﾄ!$A$3:$V$201,22))","v":""},{"$f":"IF($C9=\"\",\"\",VLOOKUP($C9,男子ﾃﾞｰﾀ貼付ｼｰﾄ!$A$3:$V$201,18))","v":""},{"$f":"IF($C9=\"\",\"\",VLOOKUP($C9,男子ﾃﾞｰﾀ貼付ｼｰﾄ!$A$3:$V$201,16))","v":""},{"$f":"IF($C9=\"\",\"\",VLOOKUP($C9,男子ﾃﾞｰﾀ貼付ｼｰﾄ!$A$3:$V$201,12))","v":""},{"$f":"IF($C9=\"\",\"\",VLOOKUP($C9,男子ﾃﾞｰﾀ貼付ｼｰﾄ!$A$3:$V$201,9))","v":""}]
[3,null,null,{"$f":"IF($C10=\"\",\"\",VLOOKUP($C10,男子ﾃﾞｰﾀ貼付ｼｰﾄ!$A$3:$V$201,5))","v":""},{"$f":"IF($C10=\"\",\"\",VLOOKUP($C10,男子ﾃﾞｰﾀ貼付ｼｰﾄ!$A$3:$V$201,2))","v":""},{"$f":"IF($C10=\"\",\"\",VLOOKUP($C10,男子ﾃﾞｰﾀ貼付ｼｰﾄ!$A$3:$V$201,3))","v":""},"男",{"$f":"IF($C10=\"\",\"\",VLOOKUP($C10,男子ﾃﾞｰﾀ貼付ｼｰﾄ!$A$3:$V$201,22))","v":""},{"$f":"IF($C10=\"\",\"\",VLOOKUP($C10,男子ﾃﾞｰﾀ貼付ｼｰﾄ!$A$3:$V$201,18))","v":""},{"$f":"IF($C10=\"\",\"\",VLOOKUP($C10,男子ﾃﾞｰﾀ貼付ｼｰﾄ!$A$3:$V$201,16))","v":""},{"$f":"IF($C10=\"\",\"\",VLOOKUP($C10,男子ﾃﾞｰﾀ貼付ｼｰﾄ!$A$3:$V$201,12))","v":""},{"$f":"IF($C10=\"\",\"\",VLOOKUP($C10,男子ﾃﾞｰﾀ貼付ｼｰﾄ!$A$3:$V$201,9))","v":""}]
[4,null,null,{"$f":"IF($C11=\"\",\"\",VLOOKUP($C11,男子ﾃﾞｰﾀ貼付ｼｰﾄ!$A$3:$V$201,5))","v":""},{"$f":"IF($C11=\"\",\"\",VLOOKUP($C11,男子ﾃﾞｰﾀ貼付ｼｰﾄ!$A$3:$V$201,2))","v":""},{"$f":"IF($C11=\"\",\"\",VLOOKUP($C11,男子ﾃﾞｰﾀ貼付ｼｰﾄ!$A$3:$V$201,3))","v":""},"男",{"$f":"IF($C11=\"\",\"\",VLOOKUP($C11,男子ﾃﾞｰﾀ貼付ｼｰﾄ!$A$3:$V$201,22))","v":""},{"$f":"IF($C11=\"\",\"\",VLOOKUP($C11,男子ﾃﾞｰﾀ貼付ｼｰﾄ!$A$3:$V$201,18))","v":""},{"$f":"IF($C11=\"\",\"\",VLOOKUP($C11,男子ﾃﾞｰﾀ貼付ｼｰﾄ!$A$3:$V$201,16))","v":""},{"$f":"IF($C11=\"\",\"\",VLOOKUP($C11,男子ﾃﾞｰﾀ貼付ｼｰﾄ!$A$3:$V$201,12))","v":""},{"$f":"IF($C11=\"\",\"\",VLOOKUP($C11,男子ﾃﾞｰﾀ貼付ｼｰﾄ!$A$3:$V$201,9))","v":""}]
[5,null,null,{"$f":"IF($C12=\"\",\"\",VLOOKUP($C12,男子ﾃﾞｰﾀ貼付ｼｰﾄ!$A$3:$V$201,5))","v":""},{"$f":"IF($C12=\"\",\"\",VLOOKUP($C12,男子ﾃﾞｰﾀ貼付ｼｰﾄ!$A$3:$V$201,2))","v":""},{"$f":"IF($C12=\"\",\"\",VLOOKUP($C12,男子ﾃﾞｰﾀ貼付ｼｰﾄ!$A$3:$V$201,3))","v":""},"男",{"$f":"IF($C12=\"\",\"\",VLOOKUP($C12,男子ﾃﾞｰﾀ貼付ｼｰﾄ!$A$3:$V$201,22))","v":""},{"$f":"IF($C12=\"\",\"\",VLOOKUP($C12,男子ﾃﾞｰﾀ貼付ｼｰﾄ!$A$3:$V$201,18))","v":""},{"$f":"IF($C12=\"\",\"\",VLOOKUP($C12,男子ﾃﾞｰﾀ貼付ｼｰﾄ!$A$3:$V$201,16))","v":""},{"$f":"IF($C12=\"\",\"\",VLOOKUP($C12,男子ﾃﾞｰﾀ貼付ｼｰﾄ!$A$3:$V$201,12))","v":""},{"$f":"IF($C12=\"\",\"\",VLOOKUP($C12,男子ﾃﾞｰﾀ貼付ｼｰﾄ!$A$3:$V$201,9))","v":""}]
[6,null,null,{"$f":"IF($C13=\"\",\"\",VLOOKUP($C13,男子ﾃﾞｰﾀ貼付ｼｰﾄ!$A$3:$V$201,5))","v":""},{"$f":"IF($C13=\"\",\"\",VLOOKUP($C13,男子ﾃﾞｰﾀ貼付ｼｰﾄ!$A$3:$V$201,2))","v":""},{"$f":"IF($C13=\"\",\"\",VLOOKUP($C13,男子ﾃﾞｰﾀ貼付ｼｰﾄ!$A$3:$V$201,3))","v":""},"男",{"$f":"IF($C13=\"\",\"\",VLOOKUP($C13,男子ﾃﾞｰﾀ貼付ｼｰﾄ!$A$3:$V$201,22))","v":""},{"$f":"IF($C13=\"\",\"\",VLOOKUP($C13,男子ﾃﾞｰﾀ貼付ｼｰﾄ!$A$3:$V$201,18))","v":""},{"$f":"IF($C13=\"\",\"\",VLOOKUP($C13,男子ﾃﾞｰﾀ貼付ｼｰﾄ!$A$3:$V$201,16))","v":""},{"$f":"IF($C13=\"\",\"\",VLOOKUP($C13,男子ﾃﾞｰﾀ貼付ｼｰﾄ!$A$3:$V$201,12))","v":""},{"$f":"IF($C13=\"\",\"\",VLOOKUP($C13,男子ﾃﾞｰﾀ貼付ｼｰﾄ!$A$3:$V$201,9))","v":""}]
[7,null,null,{"$f":"IF($C14=\"\",\"\",VLOOKUP($C14,男子ﾃﾞｰﾀ貼付ｼｰﾄ!$A$3:$V$201,5))","v":""},{"$f":"IF($C14=\"\",\"\",VLOOKUP($C14,男子ﾃﾞｰﾀ貼付ｼｰﾄ!$A$3:$V$201,2))","v":""},{"$f":"IF($C14=\"\",\"\",VLOOKUP($C14,男子ﾃﾞｰﾀ貼付ｼｰﾄ!$A$3:$V$201,3))","v":""},"男",{"$f":"IF($C14=\"\",\"\",VLOOKUP($C14,男子ﾃﾞｰﾀ貼付ｼｰﾄ!$A$3:$V$201,22))","v":""},{"$f":"IF($C14=\"\",\"\",VLOOKUP($C14,男子ﾃﾞｰﾀ貼付ｼｰﾄ!$A$3:$V$201,18))","v":""},{"$f":"IF($C14=\"\",\"\",VLOOKUP($C14,男子ﾃﾞｰﾀ貼付ｼｰﾄ!$A$3:$V$201,16))","v":""},{"$f":"IF($C14=\"\",\"\",VLOOKUP($C14,男子ﾃﾞｰﾀ貼付ｼｰﾄ!$A$3:$V$201,12))","v":""},{"$f":"IF($C14=\"\",\"\",VLOOKUP($C14,男子ﾃﾞｰﾀ貼付ｼｰﾄ!$A$3:$V$201,9))","v":""}]
[8,null,null,{"$f":"IF($C15=\"\",\"\",VLOOKUP($C15,男子ﾃﾞｰﾀ貼付ｼｰﾄ!$A$3:$V$201,5))","v":""},{"$f":"IF($C15=\"\",\"\",VLOOKUP($C15,男子ﾃﾞｰﾀ貼付ｼｰﾄ!$A$3:$V$201,2))","v":""},{"$f":"IF($C15=\"\",\"\",VLOOKUP($C15,男子ﾃﾞｰﾀ貼付ｼｰﾄ!$A$3:$V$201,3))","v":""},"男",{"$f":"IF($C15=\"\",\"\",VLOOKUP($C15,男子ﾃﾞｰﾀ貼付ｼｰﾄ!$A$3:$V$201,22))","v":""},{"$f":"IF($C15=\"\",\"\",VLOOKUP($C15,男子ﾃﾞｰﾀ貼付ｼｰﾄ!$A$3:$V$201,18))","v":""},{"$f":"IF($C15=\"\",\"\",VLOOKUP($C15,男子ﾃﾞｰﾀ貼付ｼｰﾄ!$A$3:$V$201,16))","v":""},{"$f":"IF($C15=\"\",\"\",VLOOKUP($C15,男子ﾃﾞｰﾀ貼付ｼｰﾄ!$A$3:$V$201,12))","v":""},{"$f":"IF($C15=\"\",\"\",VLOOKUP($C15,男子ﾃﾞｰﾀ貼付ｼｰﾄ!$A$3:$V$201,9))","v":""}]
{"$rows_left_out":53}
{"sheet":"女子ﾃﾞｰﾀ貼付ｼｰﾄ","index":4,"n_rows":34,"n_cols":22,"rows_kept":34,"cut":false,"hidden":false,"merged":[[1,0,1,2]]}
[]
["↓この3列には貼り付けないで！↓",null,null,"JAAF ID","会員名","会員名\nカナ","会員名\n英字(姓)","会員名\n英字(名)","国籍","性\n別","登録都道\n府県コード","登録    都道府  県名","団体ID","団体名","団体名\nカナ","団体名\n略称","団体名\n略称カナ","生年月日","都道府県  (学連)      登録番号","旧団体\nコード","備考","学年"]
[{"$f":"IF(S3=\"\",\"\",S3)","v":""},{"$f":"IF(F3=\"\",\"\",ASC(F3))","v":""},{"$f":"IF(G3=\"\",\"\",G3&\" \"&H3)","v":""}]
["","",""]
["","",""]
["","",""]
["","",""]
["","",""]
["","",""]
["","",""]
["","",""]
["","",""]
["","",""]
["","",""]
["","",""]
{"$rows_left_out":20}
{"sheet":"【様式1-2】女子団体（個人）申込書","index":5,"n_rows":68,"n_cols":19,"rows_kept":68,"cut":false,"hidden":false,"merged":[[61,13,61,16],[62,13,62,16],[66,3,66,8],[1,5,1,12],[3,5,3,12],[67,3,67,8],[5,12,6,12],[64,3,64,4],[65,3,65,8],[5,5,6,5],[5,11,6,11],[5,7,6,7],[5,9,6,9],[0,17,0,18],[5,18,6,18],[5,0,6,0],[5,1,5,2],[5,3,6,3],[5,4,6,4],[5,6,6,6],[1,15,1,17],[5,13,5,17]]}
[null,null,null,null,null,null,null,null,null,null,null,null,null,null,null,null,null,"【様式1-2】"]
[null,null,null,"大会名",null,"第６４回北陸地域陸上競技選手権大会",null,null,null,null,null,null,null,null,null,"参加申込一覧表（　女子　）"]
[]
[null,null,null,"所属学校・団体名 ",null,null,null,null,null,null,null,null,null,{"$f":"IF(F4=\"\",\"\",女子ﾃﾞｰﾀ貼付ｼｰﾄ!T3)","v":""}]
[]
[null,"ﾅﾝﾊﾞｰ",null,"氏　名","ﾌﾘｶﾞﾅ\n(半角ｶﾀｶﾅ)","ｱﾙﾌｧﾍﾞｯﾄ表記","性別","学年","生年月日","所属","登録","国籍","種目","参加標準記録",null,null,null,null,"備考"]
[null,"北","県",null,null,null,null,null,"西暦8桁の数字",null,"都道府県",null,null,"記録","順位","年月(4桁)","大会名","場所"]
[1,null,null,{"$f":"IF($C8=\"\",\"\",VLOOKUP($C8,女子ﾃﾞｰﾀ貼付ｼｰﾄ!$A$3:$V$34,5))","v":""},{"$f":"IF($C8=\"\",\"\",VLOOKUP($C8,女子ﾃﾞｰﾀ貼付ｼｰﾄ!$A$3:$V$34,2))","v":""},{"$f":"IF($C8=\"\",\"\",VLOOKUP($C8,女子ﾃﾞｰﾀ貼付ｼｰﾄ!$A$3:$V$34,3))","v":""},"女",{"$f":"IF($C8=\"\",\"\",VLOOKUP($C8,女子ﾃﾞｰﾀ貼付ｼｰﾄ!$A$3:$V$34,22))","v":""},{"$f":"IF($C8=\"\",\"\",VLOOKUP($C8,女子ﾃﾞｰﾀ貼付ｼｰﾄ!$A$3:$V$34,18))","v":""},{"$f":"IF($C8=\"\",\"\",VLOOKUP($C8,女子ﾃﾞｰﾀ貼付ｼｰﾄ!$A$3:$V$34,16))","v":""},{"$f":"IF($C8=\"\",\"\",VLOOKUP($C8,女子ﾃﾞｰﾀ貼付ｼｰﾄ!$A$3:$V$34,12))","v":""},{"$f":"IF($C8=\"\",\"\",VLOOKUP($C8,女子ﾃﾞｰﾀ貼付ｼｰﾄ!$A$3:$V$34,9))","v":""}]
[2,null,null,{"$f":"IF($C9=\"\",\"\",VLOOKUP($C9,女子ﾃﾞｰﾀ貼付ｼｰﾄ!$A$3:$V$34,5))","v":""},{"$f":"IF($C9=\"\",\"\",VLOOKUP($C9,女子ﾃﾞｰﾀ貼付ｼｰﾄ!$A$3:$V$34,2))","v":""},{"$f":"IF($C9=\"\",\"\",VLOOKUP($C9,女子ﾃﾞｰﾀ貼付ｼｰﾄ!$A$3:$V$34,3))","v":""},"女",{"$f":"IF($C9=\"\",\"\",VLOOKUP($C9,女子ﾃﾞｰﾀ貼付ｼｰﾄ!$A$3:$V$34,22))","v":""},{"$f":"IF($C9=\"\",\"\",VLOOKUP($C9,女子ﾃﾞｰﾀ貼付ｼｰﾄ!$A$3:$V$34,18))","v":""},{"$f":"IF($C9=\"\",\"\",VLOOKUP($C9,女子ﾃﾞｰﾀ貼付ｼｰﾄ!$A$3:$V$34,16))","v":""},{"$f":"IF($C9=\"\",\"\",VLOOKUP($C9,女子ﾃﾞｰﾀ貼付ｼｰﾄ!$A$3:$V$34,12))","v":""},{"$f":"IF($C9=\"\",\"\",VLOOKUP($C9,女子ﾃﾞｰﾀ貼付ｼｰﾄ!$A$3:$V$34,9))","v":""}]
[3,null,null,{"$f":"IF($C10=\"\",\"\",VLOOKUP($C10,女子ﾃﾞｰﾀ貼付ｼｰﾄ!$A$3:$V$34,5))","v":""},{"$f":"IF($C10=\"\",\"\",VLOOKUP($C10,女子ﾃﾞｰﾀ貼付ｼｰﾄ!$A$3:$V$34,2))","v":""},{"$f":"IF($C10=\"\",\"\",VLOOKUP($C10,女子ﾃﾞｰﾀ貼付ｼｰﾄ!$A$3:$V$34,3))","v":""},"女",{"$f":"IF($C10=\"\",\"\",VLOOKUP($C10,女子ﾃﾞｰﾀ貼付ｼｰﾄ!$A$3:$V$34,22))","v":""},{"$f":"IF($C10=\"\",\"\",VLOOKUP($C10,女子ﾃﾞｰﾀ貼付ｼｰﾄ!$A$3:$V$34,18))","v":""},{"$f":"IF($C10=\"\",\"\",VLOOKUP($C10,女子ﾃﾞｰﾀ貼付ｼｰﾄ!$A$3:$V$34,16))","v":""},{"$f":"IF($C10=\"\",\"\",VLOOKUP($C10,女子ﾃﾞｰﾀ貼付ｼｰﾄ!$A$3:$V$34,12))","v":""},{"$f":"IF($C10=\"\",\"\",VLOOKUP($C10,女子ﾃﾞｰﾀ貼付ｼｰﾄ!$A$3:$V$34,9))","v":""}]
[4,null,null,{"$f":"IF($C11=\"\",\"\",VLOOKUP($C11,女子ﾃﾞｰﾀ貼付ｼｰﾄ!$A$3:$V$34,5))","v":""},{"$f":"IF($C11=\"\",\"\",VLOOKUP($C11,女子ﾃﾞｰﾀ貼付ｼｰﾄ!$A$3:$V$34,2))","v":""},{"$f":"IF($C11=\"\",\"\",VLOOKUP($C11,女子ﾃﾞｰﾀ貼付ｼｰﾄ!$A$3:$V$34,3))","v":""},"女",{"$f":"IF($C11=\"\",\"\",VLOOKUP($C11,女子ﾃﾞｰﾀ貼付ｼｰﾄ!$A$3:$V$34,22))","v":""},{"$f":"IF($C11=\"\",\"\",VLOOKUP($C11,女子ﾃﾞｰﾀ貼付ｼｰﾄ!$A$3:$V$34,18))","v":""},{"$f":"IF($C11=\"\",\"\",VLOOKUP($C11,女子ﾃﾞｰﾀ貼付ｼｰﾄ!$A$3:$V$34,16))","v":""},{"$f":"IF($C11=\"\",\"\",VLOOKUP($C11,女子ﾃﾞｰﾀ貼付ｼｰﾄ!$A$3:$V$34,12))","v":""},{"$f":"IF($C11=\"\",\"\",VLOOKUP($C11,女子ﾃﾞｰﾀ貼付ｼｰﾄ!$A$3:$V$34,9))","v":""}]
[5,null,null,{"$f":"IF($C12=\"\",\"\",VLOOKUP($C12,女子ﾃﾞｰﾀ貼付ｼｰﾄ!$A$3:$V$34,5))","v":""},{"$f":"IF($C12=\"\",\"\",VLOOKUP($C12,女子ﾃﾞｰﾀ貼付ｼｰﾄ!$A$3:$V$34,2))","v":""},{"$f":"IF($C12=\"\",\"\",VLOOKUP($C12,女子ﾃﾞｰﾀ貼付ｼｰﾄ!$A$3:$V$34,3))","v":""},"女",{"$f":"IF($C12=\"\",\"\",VLOOKUP($C12,女子ﾃﾞｰﾀ貼付ｼｰﾄ!$A$3:$V$34,22))","v":""},{"$f":"IF($C12=\"\",\"\",VLOOKUP($C12,女子ﾃﾞｰﾀ貼付ｼｰﾄ!$A$3:$V$34,18))","v":""},{"$f":"IF($C12=\"\",\"\",VLOOKUP($C12,女子ﾃﾞｰﾀ貼付ｼｰﾄ!$A$3:$V$34,16))","v":""},{"$f":"IF($C12=\"\",\"\",VLOOKUP($C12,女子ﾃﾞｰﾀ貼付ｼｰﾄ!$A$3:$V$34,12))","v":""},{"$f":"IF($C12=\"\",\"\",VLOOKUP($C12,女子ﾃﾞｰﾀ貼付ｼｰﾄ!$A$3:$V$34,9))","v":""}]
[6,null,null,{"$f":"IF($C13=\"\",\"\",VLOOKUP($C13,女子ﾃﾞｰﾀ貼付ｼｰﾄ!$A$3:$V$34,5))","v":""},{"$f":"IF($C13=\"\",\"\",VLOOKUP($C13,女子ﾃﾞｰﾀ貼付ｼｰﾄ!$A$3:$V$34,2))","v":""},{"$f":"IF($C13=\"\",\"\",VLOOKUP($C13,女子ﾃﾞｰﾀ貼付ｼｰﾄ!$A$3:$V$34,3))","v":""},"女",{"$f":"IF($C13=\"\",\"\",VLOOKUP($C13,女子ﾃﾞｰﾀ貼付ｼｰﾄ!$A$3:$V$34,22))","v":""},{"$f":"IF($C13=\"\",\"\",VLOOKUP($C13,女子ﾃﾞｰﾀ貼付ｼｰﾄ!$A$3:$V$34,18))","v":""},{"$f":"IF($C13=\"\",\"\",VLOOKUP($C13,女子ﾃﾞｰﾀ貼付ｼｰﾄ!$A$3:$V$34,16))","v":""},{"$f":"IF($C13=\"\",\"\",VLOOKUP($C13,女子ﾃﾞｰﾀ貼付ｼｰﾄ!$A$3:$V$34,12))","v":""},{"$f":"IF($C13=\"\",\"\",VLOOKUP($C13,女子ﾃﾞｰﾀ貼付ｼｰﾄ!$A$3:$V$34,9))","v":""}]
[7,null,null,{"$f":"IF($C14=\"\",\"\",VLOOKUP($C14,女子ﾃﾞｰﾀ貼付ｼｰﾄ!$A$3:$V$34,5))","v":""},{"$f":"IF($C14=\"\",\"\",VLOOKUP($C14,女子ﾃﾞｰﾀ貼付ｼｰﾄ!$A$3:$V$34,2))","v":""},{"$f":"IF($C14=\"\",\"\",VLOOKUP($C14,女子ﾃﾞｰﾀ貼付ｼｰﾄ!$A$3:$V$34,3))","v":""},"女",{"$f":"IF($C14=\"\",\"\",VLOOKUP($C14,女子ﾃﾞｰﾀ貼付ｼｰﾄ!$A$3:$V$34,22))","v":""},{"$f":"IF($C14=\"\",\"\",VLOOKUP($C14,女子ﾃﾞｰﾀ貼付ｼｰﾄ!$A$3:$V$34,18))","v":""},{"$f":"IF($C14=\"\",\"\",VLOOKUP($C14,女子ﾃﾞｰﾀ貼付ｼｰﾄ!$A$3:$V$34,16))","v":""},{"$f":"IF($C14=\"\",\"\",VLOOKUP($C14,女子ﾃﾞｰﾀ貼付ｼｰﾄ!$A$3:$V$34,12))","v":""},{"$f":"IF($C14=\"\",\"\",VLOOKUP($C14,女子ﾃﾞｰﾀ貼付ｼｰﾄ!$A$3:$V$34,9))","v":""}]
[8,null,null,{"$f":"IF($C15=\"\",\"\",VLOOKUP($C15,女子ﾃﾞｰﾀ貼付ｼｰﾄ!$A$3:$V$34,5))","v":""},{"$f":"IF($C15=\"\",\"\",VLOOKUP($C15,女子ﾃﾞｰﾀ貼付ｼｰﾄ!$A$3:$V$34,2))","v":""},{"$f":"IF($C15=\"\",\"\",VLOOKUP($C15,女子ﾃﾞｰﾀ貼付ｼｰﾄ!$A$3:$V$34,3))","v":""},"女",{"$f":"IF($C15=\"\",\"\",VLOOKUP($C15,女子ﾃﾞｰﾀ貼付ｼｰﾄ!$A$3:$V$34,22))","v":""},{"$f":"IF($C15=\"\",\"\",VLOOKUP($C15,女子ﾃﾞｰﾀ貼付ｼｰﾄ!$A$3:$V$34,18))","v":""},{"$f":"IF($C15=\"\",\"\",VLOOKUP($C15,女子ﾃﾞｰﾀ貼付ｼｰﾄ!$A$3:$V$34,16))","v":""},{"$f":"IF($C15=\"\",\"\",VLOOKUP($C15,女子ﾃﾞｰﾀ貼付ｼｰﾄ!$A$3:$V$34,12))","v":""},{"$f":"IF($C15=\"\",\"\",VLOOKUP($C15,女子ﾃﾞｰﾀ貼付ｼｰﾄ!$A$3:$V$34,9))","v":""}]
{"$rows_left_out":54}
{"sheet":"【様式5-1】2020年宿泊要項","index":6,"n_rows":68,"n_cols":16,"rows_kept":68,"cut":false,"hidden":false,"merged":[[59,1,60,2],[59,3,59,5],[59,6,59,8],[59,9,60,17],[60,3,60,5],[60,6,60,8],[35,1,36,16],[57,1,58,2],[57,3,57,5],[57,6,57,8],[57,9,57,11],[57,12,57,14],[57,15,57,17],[58,3,58,5],[58,6,58,8],[58,9,58,11],[58,12,58,14],[58,15,58,17],[27,1,27,2],[28,1,28,3],[28,4,28,6],[28,7,28,16],[29,1,30,3],[29,4,30,6],[29,7,32,16],[31,1,32,3],[31,4,32,6],[24,15,26,16],[19,1,21,1],[19,2,21,3],[19,4,21,8],[19,9,21,11],[19,12,23,14],[19,15,23,16],[22,1,23,1],[22,2,23,3],[22,4,23,8],[22,9,23,11],[24,1,26,1],[24,2,26,3],[24,4,26,8],[24,9,26,11],[24,12,26,14],[16,15,18,16],[13,1,15,1],[13,2,15,3],[13,4,15,8],[13,9,15,11],[13,12,15,14],[13,15,15,16],[16,1,18,1],[16,2,18,3],[16,4,18,8],[16,9,18,11],[16,12,18,14],[0,0,2,17],[3,0,4,17],[12,2,12,3],[12,4,12,8],[12,9,12,11],[12,12,12,14],[12,15,12,16]]}
["第64回北陸陸上競技選手権大会\n兼 第105回日本陸上競技選手権大会北陸地域予選会"]
[]
[]
["宿泊・弁当　申込要項"]
[]
[null,"　第64回北陸陸上競技選手権大会　兼　第105回日本陸上競技選手権大会北陸地域予選会に参加される"]
[null,"選手ならびに引率の方の宿泊・弁当の申込につきまして、下記にてご案内申し上げます。"]
[]
[null,"１．宿泊施設、宿泊料金のご案内"]
[null,"　ご利用宿泊日　2020年8月21日（金）・8月22日（土）"]
[null,"　【宿泊施設】料金は税込表示、おひとり様あたり（1泊2食料金）"]
[null,"　欠食については夕食＠1,500円、朝食＠500円を差し引きさせていただきます（Aタイプの朝食欠食は不可）。"]
[null,"タイプ記号","地区",null,"施設名",null,null,null,null,"部屋タイプ",null,null,"料金",null,null,"申込可能人員"]
[null,"S","長岡駅前",null,"・長岡グランドホテル　　　　　　　　　　　　　　　　　　　　　　　　　　　　　　　",null,null,null,null,"洋室シングル・ツイン",null,null,12000,null,null,"５０名"]
[]
{"$rows_left_out":54}
{"sheet":"【様式5-2】2020年宿泊申込書","index":7,"n_rows":67,"n_cols":20,"rows_kept":67,"cut":false,"hidden":false,"merged":[[63,1,64,2],[63,3,63,20],[66,1,67,20],[61,1,62,4],[61,5,61,9],[61,13,62,13],[61,15,61,16],[61,17,61,20],[62,5,62,9],[62,15,62,16],[62,17,62,20],[56,1,56,3],[56,4,56,8],[56,9,56,10],[56,11,56,13],[56,14,56,15],[57,1,57,3],[57,4,57,8],[57,9,57,10],[57,11,57,13],[57,14,57,15],[30,1,41,3],[52,11,53,16],[54,1,54,15],[55,1,55,3],[55,4,55,8],[55,9,55,10],[55,11,55,13],[55,14,55,15],[46,4,49,5],[46,6,47,6],[46,11,47,16],[48,6,49,6],[48,11,49,16],[50,4,53,4],[50,5,53,5],[50,6,51,6],[50,11,51,16],[52,6,53,6],[42,1,53,3],[42,4,45,4],[42,5,45,5],[42,6,43,6],[42,7,53,10],[42,11,43,16],[42,17,53,20],[44,6,45,6],[44,11,45,16],[38,4,41,4],[38,5,41,5],[38,6,39,6],[38,7,39,10],[38,11,39,16],[38,17,39,20],[40,6,41,6],[40,7,41,10],[40,11,41,16],[40,17,41,20],[28,6,29,6],[28,7,29,10],[28,17,29,20],[30,17,31,20],[32,6,33,6],[32,7,33,10],[32,11,33,16],[32,17,33,20],[34,4,37,5],[34,6,35,6],[34,7,35,10],[34,11,35,16],[34,17,35,20],[30,4,33,4],[30,5,33,5],[30,6,31,6],[30,7,31,10],[30,11,31,16],[36,6,37,6],[36,7,37,10],[36,11,37,16],[36,17,37,20],[16,1,17,3],[16,4,17,20],[18,1,29,3],[18,4,21,4],[18,5,21,5],[18,6,19,6],[18,7,19,10],[18,11,29,16],[18,17,19,20],[20,6,21,6],[20,7,21,10],[20,17,21,20],[22,4,25,5],[22,6,23,6],[22,7,23,10],[22,17,23,20],[24,6,25,6],[24,7,25,10],[24,17,25,20],[26,4,29,4],[26,5,29,5],[26,6,27,6],[26,7,27,10],[26,17,27,20],[0,19,1,20],[2,19,3,20],[3,1,4,6],[3,8,3,14],[4,8,4,14],[5,12,7,20],[7,1,7,2],[13,1,15,10],[13,11,15,20]]}
[null,"　第64回北陸陸上競技選手権大会",null,null,null,null,null,null,null,null,null,null,null,null,null,null,null,null,null,"県名"]
[null,"　兼　第105回日本陸上競技選手権大会北陸地域予選会"]
[]
[null,"FAX送信先：025-248-6167\n（株）日本旅行新潟支店　宛\n（TEL：025-248-1013）",null,null,null,null,null,null,"宿　泊　申　込　書"]
[null,null,null,null,null,null,null,null,"申込締切：7月22日（水）17：30"]
[null,"申込責任者名　",null,null,null,null,null,null,null,null,null,null,"　　　TEL：　　　　　　　　-　　　　　　　　　-　　　　　　　　　　.\n\n　　　FAX：　　　　　　　　-　　　　　　　　　-　　　　　　　　　　.\n\n　　E-mail：　　　　　　　　　　　　@　　　　　　　　　　　　　　　　　."]
[]
[null,"郵送先                                所在地",null,"〒　　　　-"]
[]
[null,"連絡責任者",null,null,null,null,null,null,null,null,null,null,"携帯電話",null,null,null," -",null,"-"]
[]
[]
[null,"下記の通り申し込みいたします。"]
[null,"宿泊希望施設タイプ記号",null,null,null,null,null,null,null,null,null,"第１希望【　　　　　　】　第２希望【　　　　　　】　第３希望【　　　　　　】"]
[]
{"$rows_left_out":52}